program: Orca
programVersion: 5.0.2
elementType: S F F O O N C C C C C C C C C C C C C C C C C H H H H H H H H H H H H H H H H H
charge: 0
multiplicity: 1
keywords: wb97x-d3
keywords: def2-TZVPP
keywords: def2/J RIJCOSX
keywords: DEFGRID2
keywords: scfconv7
keywords: smallprint printgap noloewdin
keywords: NOSOSCF
formula: C17H17F2NO2S
InChI: InChI=1/C17H17F2NO2S/c1-11-6-7-23-16(11)15-8-17(2,22-20-15)10-21-9-12-13(18)4-3-5-14(12)19/h3-7H,8-10H2,1-2H3
40 atoms
S  3.636694 0.936548 -1.074808
F  -1.819023 -1.252127 -2.913264
F  -4.367237 -1.312308 1.009449
O  -0.007878 1.568121 2.097296
O  -2.078548 0.980897 -0.796964
N  1.323886 1.253076 2.095558
C  -0.487628 1.816897 0.750342
C  0.73255 1.543027 -0.133023
C  -1.612881 0.816732 0.523139
C  1.771492 1.237499 0.898748
C  -0.962292 3.254916 0.672682
C  3.150018 0.943035 0.58398
C  4.206139 0.649261 1.418741
C  -3.274821 0.286529 -1.075508
C  -3.122895 -1.208047 -0.97262
C  5.400012 0.423792 0.683272
C  4.142144 0.570313 2.908023
C  5.242979 0.545347 -0.663732
C  -2.379568 -1.927188 -1.900048
C  -3.663605 -1.953384 0.065638
C  -2.198783 -3.293316 -1.840224
C  -3.512715 -3.321632 0.181813
C  -2.775866 -3.986149 -0.785525
H  1.008031 2.406454 -0.742962
H  0.592418 0.697464 -0.811309
H  -2.418341 0.994717 1.248484
H  -1.233177 -0.200353 0.68779
H  -1.792823 3.434577 1.356921
H  -0.152851 3.941244 0.925183
H  -1.296655 3.498519 -0.334953
H  -3.559862 0.563566 -2.090733
H  -4.078257 0.628505 -0.416901
H  6.343832 0.17996 1.151164
H  3.459215 -0.211498 3.242379
H  5.126795 0.352788 3.318788
H  3.792061 1.504155 3.34849
H  5.991671 0.423673 -1.431726
H  -1.620036 -3.803465 -2.598205
H  -3.958862 -3.852277 1.011984
H  -2.646396 -5.057348 -0.716258
elementType: S F O N C H
totalener: -1461.18468012 hartree
nucrepener: 2059.27820787 hartree
electener: -3520.46288799 hartree
oneelecener: -6096.79164179 hartree
twoeener: 2576.32875381 hartree
cpcmener: -0.02788630 hartree
kineticenergy: 1456.14657593 hartree
xcener: -118.604030710674 hartree
chargesum: -0.0000000
charge: 0.037260 -0.218995 -0.219600 -0.284351 -0.379510 -0.151981 0.292482 -0.129870 -0.047323 0.287482 -0.325294 -0.122846 -0.176532 0.054205 -0.218125 -0.147227 -0.218830 -0.186802 0.287484 0.359704 -0.235681 -0.225673 -0.101222 0.117243 0.116432 0.110983 0.105431 0.102995 0.109409 0.094758 0.116860 0.106664 0.155390 0.099189 0.099549 0.097443 0.166177 0.152858 0.152397 0.167465
qa: 0.0373 -0.2190 -0.2196 -0.2844 -0.3795 -0.1520 0.2925 -0.1299 -0.0473 0.2875 -0.3253 -0.1228 -0.1765 0.0542 -0.2181 -0.1472 -0.2188 -0.1868 0.2875 0.3597 -0.2357 -0.2257 -0.1012 0.1172 0.1164 0.1110 0.1054 0.1030 0.1094 0.0948 0.1169 0.1067 0.1554 0.0992 0.0995 0.0974 0.1662 0.1529 0.1524 0.1675
va: 2.7795 1.0709 1.0664 1.9498 1.9266 2.9377 3.8686 3.9216 3.9826 3.5663 3.9852 3.6604 3.7774 3.8981 3.5305 3.9316 3.9312 4.0311 3.8880 3.7686 3.9355 3.9462 3.8265 1.0079 1.0200 1.0015 0.9976 1.0058 1.0017 1.0146 0.9921 1.0094 1.0002 1.0026 1.0024 1.0036 0.9970 0.9995 1.0000 0.9845
dispcorr: -0.018905658 hartree
energy: -1461.203585776872
dipole: 9.12068 -8.98222 0.13846 7.47401 -8.53109 -1.05708 8.42598 -9.46565 -1.03967
magnitude: 1.48912 au
magnitude: 3.78505 debye
