program: Orca
programVersion: 5.0.2
elementType: S F F O O N C C C C C C C C C C C C C C C C C H H H H H H H H H H H H H H H H H
charge: 0
multiplicity: 1
keywords: wb97x-d3
keywords: def2-TZVPP
keywords: def2/J RIJCOSX
keywords: DEFGRID2
keywords: scfconv7
keywords: smallprint printgap noloewdin
keywords: NOSOSCF
formula: C17H17F2NO2S
InChI: InChI=1/C17H17F2NO2S/c1-11-6-7-23-16(11)15-8-17(2,22-20-15)10-21-9-12-13(18)4-3-5-14(12)19/h3-7H,8-10H2,1-2H3
40 atoms
S  3.611219 0.903092 -1.062989
F  -1.888569 -1.221526 -2.97914
F  -4.263905 -1.341473 1.04874
O  -0.029664 1.60393 2.09887
O  -2.09515 0.996162 -0.796526
N  1.294506 1.258462 2.099255
C  -0.506187 1.847179 0.74926
C  0.718876 1.578406 -0.129269
C  -1.623944 0.837818 0.522392
C  1.746016 1.241205 0.903933
C  -0.991295 3.280966 0.667682
C  3.12061 0.922593 0.594275
C  4.169732 0.615845 1.433285
C  -3.282239 0.284055 -1.072815
C  -3.101486 -1.207661 -0.98123
C  5.362365 0.371045 0.701575
C  4.101312 0.542461 2.922687
C  5.211227 0.493514 -0.645899
C  -2.381846 -1.909331 -1.940027
C  -3.580521 -1.965383 0.078266
C  -2.15733 -3.269103 -1.884374
C  -3.389714 -3.329277 0.187608
C  -2.671732 -3.974878 -0.806425
H  1.010757 2.452129 -0.716615
H  0.572833 0.752202 -0.829203
H  -2.429258 1.010258 1.2489
H  -1.23523 -0.176026 0.687352
H  -1.321887 3.520771 -0.34108
H  -1.826006 3.454782 1.347305
H  -0.188657 3.973092 0.9241
H  -3.577067 0.564104 -2.084326
H  -4.087169 0.607027 -0.406398
H  6.301311 0.115799 1.172741
H  5.083082 0.318478 3.336762
H  3.757576 1.480395 3.358599
H  3.411587 -0.23277 3.257524
H  5.960091 0.359151 -1.411199
H  -1.59394 -3.764609 -2.663054
H  -3.790076 -3.871187 1.033437
H  -2.508327 -5.041501 -0.740152
elementType: S F O N C H
totalener: -1461.18475531 hartree
nucrepener: 2061.52541915 hartree
electener: -3522.71017446 hartree
oneelecener: -6101.28153229 hartree
twoeener: 2578.57135783 hartree
cpcmener: -0.02782990 hartree
kineticenergy: 1456.15074498 hartree
xcener: -118.604836708637 hartree
chargesum: -0.0000000
charge: 0.037110 -0.219101 -0.219419 -0.284476 -0.379812 -0.152685 0.293353 -0.126413 -0.052044 0.286135 -0.324391 -0.122231 -0.176634 0.055887 -0.216905 -0.147391 -0.218720 -0.186668 0.286920 0.356041 -0.234335 -0.222442 -0.103443 0.117562 0.115731 0.111205 0.106188 0.095116 0.103144 0.108956 0.115019 0.107955 0.155376 0.099544 0.097251 0.099305 0.166204 0.152813 0.152717 0.167579
qa: 0.0371 -0.2191 -0.2194 -0.2845 -0.3798 -0.1527 0.2934 -0.1264 -0.0520 0.2861 -0.3244 -0.1222 -0.1766 0.0559 -0.2169 -0.1474 -0.2187 -0.1867 0.2869 0.3560 -0.2343 -0.2224 -0.1034 0.1176 0.1157 0.1112 0.1062 0.0951 0.1031 0.1090 0.1150 0.1080 0.1554 0.0995 0.0973 0.0993 0.1662 0.1528 0.1527 0.1676
va: 2.7797 1.0711 1.0667 1.9497 1.9267 2.9380 3.8706 3.9183 3.9891 3.5685 3.9830 3.6601 3.7775 3.8951 3.5301 3.9318 3.9315 4.0309 3.8876 3.7700 3.9341 3.9440 3.8290 1.0083 1.0200 1.0016 0.9973 1.0144 1.0059 1.0022 0.9931 1.0085 1.0002 1.0025 1.0037 1.0025 0.9970 0.9994 0.9998 0.9844
dispcorr: -0.018923003 hartree
energy: -1461.203678314176
dipole: 9.07924 -8.89963 0.17962 7.51917 -8.58188 -1.06270 8.48329 -9.51962 -1.03633
magnitude: 1.49518 au
magnitude: 3.80045 debye
