program: Orca
programVersion: 5.0.2
elementType: S F F O O N C C C C C C C C C C C C C C C C C H H H H H H H H H H H H H H H H H
charge: 0
multiplicity: 1
keywords: wb97x-d3
keywords: def2-TZVPP
keywords: def2/J RIJCOSX
keywords: DEFGRID2
keywords: scfconv7
keywords: smallprint printgap noloewdin
keywords: NOSOSCF
formula: C17H17F2NO2S
InChI: InChI=1/C17H17F2NO2S/c1-11-6-7-23-16(11)15-8-17(2,22-20-15)10-21-9-12-13(18)4-3-5-14(12)19/h3-7H,8-10H2,1-2H3
40 atoms
S  3.126622 1.052913 -0.769609
F  -3.305002 -1.441212 1.118086
F  -0.604671 -0.571165 -2.604693
O  -1.217579 1.04005 1.416949
O  -2.328419 1.384284 -1.423648
N  -0.017533 0.39101 1.505602
C  -1.100359 2.212112 0.569205
C  0.229389 1.997445 -0.151203
C  -2.316292 2.289189 -0.34636
C  0.803606 0.874625 0.653999
C  -1.072741 3.435473 1.471189
C  2.139773 0.3557 0.468377
C  2.796881 -0.667602 1.116036
C  -2.948598 0.133743 -1.222261
C  -2.006389 -0.950033 -0.768705
C  4.100068 -0.864813 0.585246
C  2.252899 -1.475774 2.246583
C  4.411866 -0.013267 -0.430307
C  -2.223796 -1.711018 0.369577
C  -0.862536 -1.26878 -1.487602
C  -1.389087 -2.732223 0.776337
C  0.017884 -2.267472 -1.12349
C  -0.261737 -3.00506 0.016931
H  0.856921 2.890415 -0.123277
H  0.122166 1.708595 -1.199278
H  -2.326493 3.288896 -0.78729
H  -3.227851 2.197907 0.257764
H  -0.251066 3.374166 2.185966
H  -0.932648 4.340533 0.880005
H  -2.004771 3.538147 2.029524
H  -3.380048 -0.155807 -2.18346
H  -3.784132 0.2251 -0.524162
H  4.778297 -1.621587 0.954738
H  2.10485 -0.865231 3.137962
H  1.288637 -1.918412 2.003577
H  2.940229 -2.279281 2.503476
H  5.330369 0.039164 -0.994973
H  -1.61219 -3.296623 1.671784
H  0.895372 -2.467706 -1.723457
H  0.408375 -3.798364 0.318194
elementType: S F O N C H
totalener: -1461.18221209 hartree
nucrepener: 2259.55946792 hartree
electener: -3720.74168002 hartree
oneelecener: -6498.43102886 hartree
twoeener: 2777.68934885 hartree
cpcmener: -0.02938138 hartree
kineticenergy: 1456.15493732 hartree
xcener: -118.613016271987 hartree
chargesum: -0.0000000
charge: 0.036752 -0.224663 -0.220879 -0.285561 -0.382077 -0.114946 0.299527 -0.160691 -0.010557 0.272803 -0.336596 -0.145116 -0.198292 0.030148 -0.135275 -0.135482 -0.231686 -0.192352 0.332429 0.315572 -0.216667 -0.257687 -0.137674 0.128509 0.121216 0.111046 0.100330 0.110307 0.098602 0.107285 0.122572 0.105409 0.154490 0.108037 0.093183 0.102391 0.166653 0.148904 0.148021 0.172014
qa: 0.0368 -0.2247 -0.2209 -0.2856 -0.3821 -0.1149 0.2995 -0.1607 -0.0106 0.2728 -0.3366 -0.1451 -0.1983 0.0301 -0.1353 -0.1355 -0.2317 -0.1924 0.3324 0.3156 -0.2167 -0.2577 -0.1377 0.1285 0.1212 0.1110 0.1003 0.1103 0.0986 0.1073 0.1226 0.1054 0.1545 0.1080 0.0932 0.1024 0.1667 0.1489 0.1480 0.1720
va: 2.7799 1.0609 1.0688 1.9507 1.9396 2.9119 3.7711 3.9390 3.9306 3.5056 3.9972 3.6076 3.7421 3.9252 3.5242 3.9250 3.9298 4.0371 3.7937 3.7948 3.8938 3.8830 3.7892 1.0107 1.0325 0.9980 1.0094 0.9991 1.0052 1.0046 0.9903 1.0111 1.0001 1.0004 1.0051 1.0039 0.9968 0.9999 1.0019 0.9818
dispcorr: -0.025486985 hartree
energy: -1461.207699077584
dipole: 4.56573 -3.55937 1.00636 6.70463 -6.46426 0.24037 8.89842 -9.05623 -0.15781
magnitude: 1.04663 au
magnitude: 2.66033 debye
