program: Orca
programVersion: 5.0.2
elementType: S F F O O N C C C C C C C C C C C C C C C C C H H H H H H H H H H H H H H H H H
charge: 0
multiplicity: 1
keywords: wb97x-d3
keywords: def2-TZVPP
keywords: def2/J RIJCOSX
keywords: DEFGRID2
keywords: scfconv7
keywords: smallprint printgap noloewdin
keywords: NOSOSCF
formula: C17H17F2NO2S
InChI: InChI=1/C17H17F2NO2S/c1-11-6-7-23-16(11)15-8-17(2,22-20-15)10-21-9-12-13(18)4-3-5-14(12)19/h3-7H,8-10H2,1-2H3
40 atoms
S  3.434566 0.704888 -0.937701
F  -4.206263 -1.608208 0.800214
F  -1.421205 -0.86853 -2.88382
O  -0.199595 1.909179 2.082948
O  -2.203706 1.151368 -0.818222
N  1.065598 1.388483 2.132972
C  -0.638483 2.077031 0.710631
C  0.607717 1.750155 -0.115946
C  -1.746648 1.050183 0.510332
C  1.544817 1.283093 0.95279
C  -1.123869 3.501653 0.534936
C  2.876902 0.786046 0.696677
C  3.842275 0.351378 1.578797
C  -3.265581 0.274204 -1.123774
C  -2.853019 -1.17259 -1.061505
C  5.025743 -0.042156 0.899122
C  3.70151 0.289405 3.063587
C  4.950338 0.095156 -0.453408
C  -3.322826 -2.058411 -0.102927
C  -1.917165 -1.690385 -1.948098
C  -2.923328 -3.379072 -0.025693
C  -1.477465 -2.996919 -1.917889
C  -1.993771 -3.840372 -0.944272
H  1.009861 2.62511 -0.633753
H  0.428407 0.981454 -0.870968
H  -2.563716 1.241616 1.219153
H  -1.350642 0.047524 0.721686
H  -1.977766 3.712566 1.180299
H  -0.328606 4.209614 0.770455
H  -1.428857 3.681529 -0.495199
H  -3.591512 0.526446 -2.133533
H  -4.11749 0.453796 -0.461821
H  5.903105 -0.413885 1.410179
H  4.612871 -0.099285 3.514993
H  3.507905 1.273016 3.492528
H  2.875186 -0.35469 3.365685
H  5.708997 -0.133024 -1.186547
H  -3.326329 -4.0283 0.739836
H  -0.749169 -3.347348 -2.636683
H  -1.664509 -4.869314 -0.900804
elementType: S F O N C H
totalener: -1461.18518815 hartree
nucrepener: 2087.83303428 hartree
electener: -3549.01822242 hartree
oneelecener: -6153.87658496 hartree
twoeener: 2604.85836254 hartree
cpcmener: -0.02798245 hartree
kineticenergy: 1456.14143604 hartree
xcener: -118.603497960166 hartree
chargesum: -0.0000000
charge: 0.036599 -0.220752 -0.219236 -0.287379 -0.376876 -0.156363 0.311814 -0.114339 -0.081757 0.279058 -0.317667 -0.123462 -0.170655 0.052319 -0.204270 -0.149554 -0.218848 -0.185438 0.353979 0.273477 -0.223122 -0.227190 -0.107078 0.118807 0.110823 0.110864 0.110706 0.103906 0.106205 0.096722 0.120942 0.106427 0.155278 0.098966 0.098619 0.098730 0.167079 0.152744 0.152356 0.167565
qa: 0.0366 -0.2208 -0.2192 -0.2874 -0.3769 -0.1564 0.3118 -0.1143 -0.0818 0.2791 -0.3177 -0.1235 -0.1707 0.0523 -0.2043 -0.1496 -0.2188 -0.1854 0.3540 0.2735 -0.2231 -0.2272 -0.1071 0.1188 0.1108 0.1109 0.1107 0.1039 0.1062 0.0967 0.1209 0.1064 0.1553 0.0990 0.0986 0.0987 0.1671 0.1527 0.1524 0.1676
va: 2.7791 1.0645 1.0696 1.9462 1.9257 2.9389 3.8376 3.9071 4.0429 3.5767 3.9683 3.6676 3.7726 3.8967 3.5311 3.9336 3.9303 4.0297 3.7779 3.8933 3.9372 3.9334 3.8304 1.0092 1.0214 1.0019 0.9915 1.0056 1.0043 1.0134 0.9909 1.0120 1.0004 1.0026 1.0029 1.0032 0.9966 0.9994 0.9995 0.9845
dispcorr: -0.019290465 hartree
energy: -1461.204478610578
dipole: 7.92951 -7.55211 0.37740 7.29258 -8.51885 -1.22627 8.53335 -9.59617 -1.06281
magnitude: 1.66606 au
magnitude: 4.23478 debye
