program: Orca
programVersion: 5.0.2
elementType: S F F O O N C C C C C C C C C C C C C C C C C H H H H H H H H H H H H H H H H H
charge: 0
multiplicity: 1
keywords: wb97x-d3
keywords: def2-TZVPP
keywords: def2/J RIJCOSX
keywords: DEFGRID2
keywords: scfconv7
keywords: smallprint printgap noloewdin
keywords: NOSOSCF
formula: C17H17F2NO2S
InChI: InChI=1/C17H17F2NO2S/c1-11-6-7-23-16(11)15-8-17(2,22-20-15)10-21-9-12-13(18)4-3-5-14(12)19/h3-7H,8-10H2,1-2H3
40 atoms
S  3.066883 0.621533 -0.968908
F  -0.989385 -0.429308 -2.680848
F  -4.096229 -2.026505 0.432007
O  -0.344479 1.93407 2.248365
O  -2.335213 1.21785 -0.675507
N  0.883904 1.320337 2.232499
C  -0.822805 2.148817 0.897266
C  0.416753 1.909146 0.036195
C  -1.887508 1.081875 0.653353
C  1.332162 1.276781 1.036108
C  -1.374858 3.555747 0.802115
C  2.613004 0.701472 0.697739
C  3.595156 0.180087 1.511188
C  -3.218714 0.206534 -1.105271
C  -2.575925 -1.155965 -1.123007
C  4.704222 -0.281798 0.753461
C  3.537103 0.095391 3.000151
C  4.55612 -0.11293 -0.589493
C  -1.453012 -1.414984 -1.89937
C  -3.016011 -2.213122 -0.340168
C  -0.794043 -2.626348 -1.91063
C  -2.401654 -3.45066 -0.314419
C  -1.281583 -3.646616 -1.106152
H  0.85145 2.836704 -0.347978
H  0.219151 1.265112 -0.821741
H  -2.71689 1.208593 1.362246
H  -1.449481 0.089567 0.827998
H  -2.223985 3.69576 1.473359
H  -0.607425 4.287507 1.056541
H  -1.710285 3.768032 -0.212641
H  -3.531534 0.485451 -2.112537
H  -4.120366 0.190436 -0.486319
H  5.58126 -0.726602 1.202386
H  4.466804 -0.312473 3.393209
H  3.379354 1.073774 3.454301
H  2.721109 -0.544675 3.336656
H  5.250418 -0.378862 -1.371673
H  0.077554 -2.769216 -2.534814
H  -2.789524 -4.239691 0.315405
H  -0.781933 -4.605273 -1.098463
elementType: S F O N C H
totalener: -1461.18464412 hartree
nucrepener: 2124.48764580 hartree
electener: -3585.67228992 hartree
oneelecener: -6227.16735084 hartree
twoeener: 2641.49506092 hartree
cpcmener: -0.02769731 hartree
kineticenergy: 1456.13932218 hartree
xcener: -118.603622989343 hartree
chargesum: 0.0000000
charge: 0.035517 -0.218257 -0.221412 -0.291622 -0.374626 -0.159248 0.325845 -0.109310 -0.107718 0.258787 -0.307194 -0.114343 -0.161721 0.054660 -0.181643 -0.149733 -0.219037 -0.184403 0.262300 0.343719 -0.221471 -0.224061 -0.109873 0.121251 0.106089 0.112858 0.113714 0.103881 0.103462 0.097047 0.122011 0.103583 0.154953 0.098991 0.098142 0.099993 0.167031 0.151938 0.152803 0.167096
qa: 0.0355 -0.2183 -0.2214 -0.2916 -0.3746 -0.1592 0.3258 -0.1093 -0.1077 0.2588 -0.3072 -0.1143 -0.1617 0.0547 -0.1816 -0.1497 -0.2190 -0.1844 0.2623 0.3437 -0.2215 -0.2241 -0.1099 0.1213 0.1061 0.1129 0.1137 0.1039 0.1035 0.0970 0.1220 0.1036 0.1550 0.0990 0.0981 0.1000 0.1670 0.1519 0.1528 0.1671
va: 2.7794 1.0723 1.0648 1.9399 1.9306 2.9375 3.8305 3.8972 4.0650 3.5846 3.9488 3.6659 3.7641 3.9017 3.5422 3.9343 3.9293 4.0302 3.8817 3.7993 3.9322 3.9308 3.8361 1.0111 1.0205 1.0027 0.9892 1.0058 1.0064 1.0134 0.9892 1.0132 1.0004 1.0026 1.0031 1.0026 0.9966 1.0004 0.9991 0.9846
dispcorr: -0.020136672 hartree
energy: -1461.204780792868
dipole: 7.16718 -6.60523 0.56195 7.19931 -8.38956 -1.19025 9.03386 -10.21034 -1.17647
magnitude: 1.76538 au
magnitude: 4.48724 debye
