program: Orca
programVersion: 5.0.2
elementType: S F F O O N C C C C C C C C C C C C C C C C C H H H H H H H H H H H H H H H H H
charge: 0
multiplicity: 1
keywords: wb97x-d3
keywords: def2-TZVPP
keywords: def2/J RIJCOSX
keywords: DEFGRID2
keywords: scfconv7
keywords: smallprint printgap noloewdin
keywords: NOSOSCF
formula: C17H17F2NO2S
InChI: InChI=1/C17H17F2NO2S/c1-11-6-7-23-16(11)15-8-17(2,22-20-15)10-21-9-12-13(18)4-3-5-14(12)19/h3-7H,8-10H2,1-2H3
40 atoms
S  3.120285 1.174081 -0.712873
F  -0.588822 -0.591066 -2.567213
F  -3.288751 -1.468264 1.15428
O  -1.227136 1.030946 1.447704
O  -2.335384 1.35533 -1.392798
N  -0.021388 0.391868 1.525076
C  -1.127565 2.205732 0.600502
C  0.206269 2.012561 -0.119481
C  -2.342427 2.26255 -0.317418
C  0.790706 0.883337 0.669788
C  -1.120222 3.428564 1.503421
C  2.130285 0.374592 0.460828
C  2.792036 -0.691943 1.028688
C  -2.942423 0.09792 -1.193645
C  -1.992346 -0.976651 -0.734345
C  4.100112 -0.837025 0.490577
C  2.271059 -1.59908 2.093731
C  4.411072 0.09311 -0.452536
C  -0.846141 -1.291216 -1.451491
C  -2.207266 -1.736263 0.405491
C  0.036198 -2.288454 -1.087455
C  -1.369486 -2.754667 0.813287
C  -0.241819 -3.025614 0.053557
H  0.824443 2.911629 -0.073944
H  0.105162 1.741386 -1.172774
H  -2.368553 3.261405 -0.759815
H  -3.254044 2.156667 0.284226
H  -0.300156 3.376801 2.220753
H  -0.989382 4.335955 0.913489
H  -2.055393 3.518873 2.058677
H  -3.365157 -0.197144 -2.157129
H  -3.782993 0.180712 -0.500612
H  4.781418 -1.61727 0.800992
H  1.191359 -1.707401 2.057824
H  2.720196 -2.587676 2.003432
H  2.52456 -1.21757 3.085432
H  5.331936 0.193954 -1.006653
H  0.915091 -2.487624 -1.685904
H  -1.589625 -3.318675 1.709734
H  0.430926 -3.816086 0.356665
elementType: S F O N C H
totalener: -1461.18137453 hartree
nucrepener: 2259.98406977 hartree
electener: -3721.16544430 hartree
oneelecener: -6499.29977483 hartree
twoeener: 2778.13433053 hartree
cpcmener: -0.02918768 hartree
kineticenergy: 1456.15160165 hartree
xcener: -118.612757029053 hartree
chargesum: -0.0000000
charge: 0.035034 -0.221435 -0.224685 -0.283460 -0.382348 -0.113215 0.302330 -0.162239 -0.011143 0.263678 -0.336916 -0.121817 -0.208911 0.029743 -0.135886 -0.128715 -0.259785 -0.192987 0.315347 0.334751 -0.262333 -0.217720 -0.130067 0.126679 0.121372 0.111231 0.100583 0.110215 0.098730 0.107366 0.122412 0.105374 0.154831 0.091788 0.107968 0.121045 0.166738 0.147921 0.148524 0.170002
qa: 0.0350 -0.2214 -0.2247 -0.2835 -0.3823 -0.1132 0.3023 -0.1622 -0.0111 0.2637 -0.3369 -0.1218 -0.2089 0.0297 -0.1359 -0.1287 -0.2598 -0.1930 0.3153 0.3348 -0.2623 -0.2177 -0.1301 0.1267 0.1214 0.1112 0.1006 0.1102 0.0987 0.1074 0.1224 0.1054 0.1548 0.0918 0.1080 0.1210 0.1667 0.1479 0.1485 0.1700
va: 2.7784 1.0679 1.0609 1.9539 1.9391 2.9271 3.7677 3.9387 3.9313 3.5293 3.9970 3.5889 3.7487 3.9250 3.5242 3.9208 3.9336 4.0393 3.7974 3.7906 3.8865 3.8897 3.7840 1.0102 1.0332 0.9981 1.0094 0.9993 1.0050 1.0044 0.9904 1.0110 0.9985 1.0130 0.9995 0.9946 0.9967 1.0018 1.0003 0.9816
dispcorr: -0.025583552 hartree
energy: -1461.206958086483
dipole: 4.46639 -3.46157 1.00482 6.31379 -6.10002 0.21377 8.38804 -8.56664 -0.17860
magnitude: 1.04272 au
magnitude: 2.65037 debye
