program: Orca
programVersion: 5.0.2
elementType: S F F O O N C C C C C C C C C C C C C C C C C H H H H H H H H H H H H H H H H H
charge: 0
multiplicity: 1
keywords: wb97x-d3
keywords: def2-TZVPP
keywords: def2/J RIJCOSX
keywords: DEFGRID2
keywords: scfconv7
keywords: smallprint printgap noloewdin
keywords: NOSOSCF
formula: C17H17F2NO2S
InChI: InChI=1/C17H17F2NO2S/c1-11-6-7-23-16(11)15-8-17(2,22-20-15)10-21-9-12-13(18)4-3-5-14(12)19/h3-7H,8-10H2,1-2H3
40 atoms
S  2.490514 0.396877 -1.338151
F  -1.853987 -0.204591 -2.752078
F  -1.919671 -2.141024 1.509951
O  -0.250168 2.510302 2.086674
O  -2.771278 1.09672 -0.099269
N  0.837219 1.66702 1.982436
C  -1.015966 2.450091 0.858885
C  0.028525 2.01578 -0.160029
C  -2.063745 1.357677 1.09372
C  1.003992 1.344051 0.755812
C  -1.631034 3.804644 0.594672
C  2.03065 0.423566 0.326359
C  2.731977 -0.50864 1.059054
C  -3.140216 -0.258096 -0.271746
C  -1.955144 -1.12862 -0.605987
C  3.633424 -1.238306 0.23895
C  2.574746 -0.765225 2.5214
C  3.611503 -0.856228 -1.068242
C  -1.332644 -1.046074 -1.846363
C  -1.366895 -2.005573 0.294787
C  -0.210014 -1.767964 -2.19031
C  -0.235434 -2.747306 0.011738
C  0.338768 -2.620097 -1.242506
H  0.501375 2.867989 -0.659856
H  -0.366283 1.36238 -0.934724
H  -2.755187 1.678375 1.882753
H  -1.554919 0.459658 1.459291
H  -2.307999 4.096871 1.3985
H  -0.861289 4.569856 0.491462
H  -2.204389 3.7841 -0.331796
H  -3.861524 -0.279304 -1.088806
H  -3.657699 -0.641324 0.611547
H  4.272533 -2.023717 0.618244
H  1.525622 -0.856305 2.805362
H  3.083325 -1.686402 2.801706
H  2.996863 0.041224 3.122228
H  4.202973 -1.248399 -1.881787
H  0.231335 -1.661438 -3.171766
H  0.183367 -3.409677 0.757325
H  1.225727 -3.188684 -1.485401
elementType: S F O N C H
totalener: -1461.18325388 hartree
nucrepener: 2251.77299194 hartree
electener: -3712.95624581 hartree
oneelecener: -6481.43989263 hartree
twoeener: 2768.48364682 hartree
cpcmener: -0.02839396 hartree
kineticenergy: 1456.13861877 hartree
xcener: -118.606986592321 hartree
chargesum: -0.0000000
charge: 0.040553 -0.220823 -0.222253 -0.297028 -0.390217 -0.144100 0.328917 -0.137439 -0.114691 0.191266 -0.282264 -0.039512 -0.204893 0.052858 -0.147769 -0.135899 -0.229544 -0.179732 0.278772 0.331608 -0.250681 -0.226301 -0.094912 0.125150 0.126019 0.116445 0.109294 0.103424 0.100046 0.097312 0.117884 0.111635 0.155352 0.098190 0.100731 0.106027 0.165366 0.146185 0.149933 0.165093
qa: 0.0406 -0.2208 -0.2223 -0.2970 -0.3902 -0.1441 0.3289 -0.1374 -0.1147 0.1913 -0.2823 -0.0395 -0.2049 0.0529 -0.1478 -0.1359 -0.2295 -0.1797 0.2788 0.3316 -0.2507 -0.2263 -0.0949 0.1252 0.1260 0.1164 0.1093 0.1034 0.1000 0.0973 0.1179 0.1116 0.1554 0.0982 0.1007 0.1060 0.1654 0.1462 0.1499 0.1651
va: 2.7524 1.0655 1.0619 1.9502 1.9156 2.9272 3.8471 3.9027 4.0534 3.6378 3.9153 3.6079 3.7613 3.9013 3.5268 3.8953 3.9307 4.0032 3.8182 3.7518 3.9025 3.8869 3.7512 1.0124 1.0096 1.0067 0.9829 1.0061 1.0102 1.0125 0.9940 1.0041 0.9998 1.0036 1.0020 1.0000 0.9955 1.0069 1.0008 0.9857
dispcorr: -0.025700590 hartree
energy: -1461.208954466258
dipole: 3.65229 -2.99540 0.65688 5.41078 -6.96306 -1.55229 7.06348 -8.39287 -1.32939
magnitude: 2.14672 au
magnitude: 5.45652 debye
