program: Orca
programVersion: 5.0.2
elementType: S F F O O N C C C C C C C C C C C C C C C C C H H H H H H H H H H H H H H H H H
charge: 0
multiplicity: 1
keywords: wb97x-d3
keywords: def2-TZVPP
keywords: def2/J RIJCOSX
keywords: DEFGRID2
keywords: scfconv7
keywords: smallprint printgap noloewdin
keywords: NOSOSCF
formula: C17H17F2NO2S
InChI: InChI=1/C17H17F2NO2S/c1-11-6-7-23-16(11)15-8-17(2,22-20-15)10-21-9-12-13(18)4-3-5-14(12)19/h3-7H,8-10H2,1-2H3
40 atoms
S  2.839151 0.597865 -1.119183
F  -3.91552 -2.20989 0.531188
F  -0.455489 -0.63815 -2.198824
O  -0.47569 2.35071 1.99479
O  -1.784974 0.751217 0.11702
N  0.586192 1.486537 1.983117
C  -0.7576 2.835934 0.654695
C  0.481084 2.416943 -0.138613
C  -2.013481 2.140093 0.157659
C  1.128127 1.474868 0.825563
C  -0.970525 4.333308 0.720631
C  2.273391 0.651279 0.513101
C  3.036735 -0.148746 1.335191
C  -2.707237 0.053142 -0.691442
C  -2.218667 -1.355908 -0.836817
C  4.075977 -0.793395 0.612934
C  2.829466 -0.339244 2.8009
C  4.089404 -0.486625 -0.713611
C  -2.826355 -2.436947 -0.216126
C  -1.083884 -1.650372 -1.583522
C  -2.372062 -3.736294 -0.334885
C  -0.580672 -2.925831 -1.732422
C  -1.241158 -3.970361 -1.100882
H  1.145834 3.259329 -0.350342
H  0.23516 1.953089 -1.095021
H  -2.251072 2.529743 -0.84139
H  -2.863501 2.38043 0.8112
H  -1.819345 4.58944 1.355725
H  -0.083595 4.832713 1.110761
H  -1.165994 4.729134 -0.27588
H  -2.786211 0.523467 -1.67871
H  -3.710355 0.074632 -0.256274
H  4.788741 -1.461926 1.075634
H  1.882649 -0.837041 3.011947
H  3.627612 -0.948708 3.221216
H  2.81183 0.610573 3.334851
H  4.774586 -0.840887 -1.468712
H  -2.890383 -4.544181 0.163301
H  0.304242 -3.099694 -2.329311
H  -0.867085 -4.979265 -1.20596
elementType: S F O N C H
totalener: -1461.18534123 hartree
nucrepener: 2150.21705851 hartree
electener: -3611.40239974 hartree
oneelecener: -6279.98617586 hartree
twoeener: 2668.58377612 hartree
cpcmener: -0.03512996 hartree
kineticenergy: 1456.15029216 hartree
xcener: -118.604519009382 hartree
chargesum: -0.0000000
charge: 0.035559 -0.218979 -0.216835 -0.291926 -0.362008 -0.149050 0.332975 -0.133121 -0.093659 0.243475 -0.309466 -0.105451 -0.161657 0.077683 -0.189092 -0.150137 -0.221029 -0.188004 0.323974 0.289969 -0.232066 -0.225150 -0.102874 0.124648 0.111925 0.100817 0.106681 0.105954 0.103378 0.104561 0.106867 0.092700 0.155845 0.099840 0.099418 0.097349 0.166712 0.151285 0.152119 0.166770
qa: 0.0356 -0.2190 -0.2168 -0.2919 -0.3620 -0.1490 0.3330 -0.1331 -0.0937 0.2435 -0.3095 -0.1055 -0.1617 0.0777 -0.1891 -0.1501 -0.2210 -0.1880 0.3240 0.2900 -0.2321 -0.2252 -0.1029 0.1246 0.1119 0.1008 0.1067 0.1060 0.1034 0.1046 0.1069 0.0927 0.1558 0.0998 0.0994 0.0973 0.1667 0.1513 0.1521 0.1668
va: 2.7746 1.0728 1.0703 1.9411 1.9493 2.9308 3.7663 3.9309 4.0481 3.5795 3.9682 3.6217 3.7588 3.8840 3.6623 3.9309 3.9285 4.0271 3.8511 3.8427 3.9373 3.9550 3.8372 1.0132 1.0139 0.9944 1.0022 1.0064 1.0053 1.0017 0.9934 1.0037 1.0000 1.0030 1.0024 1.0036 0.9965 1.0000 1.0008 0.9845
dispcorr: -0.019921587 hartree
energy: -1461.205262817956
dipole: 5.21412 -5.00626 0.20786 11.02747 -11.22637 -0.19890 5.84026 -7.86966 -2.02939
magnitude: 2.04969 au
magnitude: 5.20989 debye
