program: Orca
programVersion: 5.0.2
elementType: S F F O O N C C C C C C C C C C C C C C C C C H H H H H H H H H H H H H H H H H
charge: 0
multiplicity: 1
keywords: wb97x-d3
keywords: def2-TZVPP
keywords: def2/J RIJCOSX
keywords: DEFGRID2
keywords: scfconv7
keywords: smallprint printgap noloewdin
keywords: NOSOSCF
formula: C17H17F2NO2S
InChI: InChI=1/C17H17F2NO2S/c1-11-6-7-23-16(11)15-8-17(2,22-20-15)10-21-9-12-13(18)4-3-5-14(12)19/h3-7H,8-10H2,1-2H3
40 atoms
S  3.32986 0.131661 2.217147
F  -0.685642 -0.857728 -2.573324
F  -4.276152 -1.769602 0.281687
O  -0.454557 2.233508 1.896784
O  -2.167911 1.163876 -1.096092
N  0.734643 1.561418 2.041221
C  -0.814386 2.306427 0.496127
C  0.493226 1.980343 -0.224667
C  -1.861601 1.214465 0.278413
C  1.283727 1.393245 0.899142
C  -1.349678 3.692119 0.205793
C  2.556467 0.719778 0.784015
C  3.302578 0.44718 -0.340197
C  -3.055848 0.129872 -1.461104
C  -2.504001 -1.238256 -1.154908
C  4.503612 -0.242512 -0.010926
C  2.954226 0.788263 -1.755524
C  4.647492 -0.478553 1.320042
C  -1.30017 -1.667625 -1.69909
C  -3.10535 -2.120368 -0.269488
C  -0.70644 -2.872811 -1.38881
C  -2.563428 -3.34422 0.074424
C  -1.351854 -3.710099 -0.489683
H  0.993661 2.870202 -0.617296
H  0.357837 1.292078 -1.056398
H  -2.758856 1.433846 0.872855
H  -1.458038 0.255713 0.630273
H  -2.250019 3.900117 0.785636
H  -0.603381 4.45181 0.439195
H  -1.601997 3.791425 -0.849364
H  -3.223655 0.237731 -2.533616
H  -4.025392 0.262574 -0.97258
H  5.228838 -0.547168 -0.75264
H  3.792742 0.558989 -2.411191
H  2.097792 0.214282 -2.112403
H  2.718192 1.843827 -1.883879
H  5.464698 -0.979066 1.817337
H  0.236708 -3.15085 -1.839619
H  -3.076207 -3.991171 0.773268
H  -0.905586 -4.659745 -0.228731
elementType: S F O N C H
totalener: -1461.18454214 hartree
nucrepener: 2130.86080829 hartree
electener: -3592.04535043 hartree
oneelecener: -6239.70444411 hartree
twoeener: 2647.65909368 hartree
cpcmener: -0.03089566 hartree
kineticenergy: 1456.13850420 hartree
xcener: -118.604323739882 hartree
chargesum: 0.0000000
charge: 0.042340 -0.219430 -0.221223 -0.293306 -0.373415 -0.148148 0.335848 -0.103012 -0.111833 0.182216 -0.306013 -0.083435 -0.119215 0.053201 -0.177112 -0.170558 -0.255027 -0.178859 0.260910 0.345448 -0.222103 -0.225125 -0.111332 0.117018 0.106409 0.113139 0.110992 0.103362 0.102588 0.097181 0.122136 0.103137 0.154156 0.105323 0.108608 0.114721 0.165168 0.155260 0.152328 0.167658
qa: 0.0423 -0.2194 -0.2212 -0.2933 -0.3734 -0.1481 0.3358 -0.1030 -0.1118 0.1822 -0.3060 -0.0834 -0.1192 0.0532 -0.1771 -0.1706 -0.2550 -0.1789 0.2609 0.3454 -0.2221 -0.2251 -0.1113 0.1170 0.1064 0.1131 0.1110 0.1034 0.1026 0.0972 0.1221 0.1031 0.1542 0.1053 0.1086 0.1147 0.1652 0.1553 0.1523 0.1677
va: 2.7841 1.0707 1.0657 1.9479 1.9308 2.9549 3.8596 3.9101 4.0567 3.7109 3.9417 3.5815 3.7295 3.8989 3.5756 3.9441 3.9297 4.0339 3.8721 3.8050 3.9351 3.9348 3.8379 1.0075 1.0293 1.0032 0.9918 1.0064 1.0074 1.0131 0.9896 1.0135 1.0020 1.0028 0.9991 0.9908 0.9968 0.9975 0.9993 0.9845
dispcorr: -0.020688452 hartree
energy: -1461.205230596725
dipole: 5.58575 -5.07334 0.51241 9.69597 -10.87403 -1.17806 -7.32772 5.30810 -2.01962
magnitude: 2.39358 au
magnitude: 6.08401 debye
