program: Orca
programVersion: 5.0.2
elementType: S F F O O N C C C C C C C C C C C C C C C C C H H H H H H H H H H H H H H H H H
charge: 0
multiplicity: 1
keywords: wb97x-d3
keywords: def2-TZVPP
keywords: def2/J RIJCOSX
keywords: DEFGRID2
keywords: scfconv7
keywords: smallprint printgap noloewdin
keywords: NOSOSCF
formula: C17H17F2NO2S
InChI: InChI=1/C17H17F2NO2S/c1-11-6-7-23-16(11)15-8-17(2,22-20-15)10-21-9-12-13(18)4-3-5-14(12)19/h3-7H,8-10H2,1-2H3
40 atoms
S  2.856545 0.653783 -1.099257
F  -3.854525 -2.320641 0.537958
F  -0.412691 -0.552108 -2.0992
O  -0.466738 2.443385 1.983252
O  -1.770424 0.765146 0.163783
N  0.579918 1.557949 1.984462
C  -0.763601 2.879667 0.630615
C  0.476567 2.450667 -0.152384
C  -2.012348 2.151983 0.159876
C  1.107646 1.506201 0.821227
C  -0.998568 4.37531 0.646292
C  2.227038 0.647687 0.510625
C  2.925476 -0.223002 1.318912
C  -2.701572 0.027214 -0.597294
C  -2.165584 -1.362291 -0.773684
C  3.9697 -0.869145 0.605324
C  2.650823 -0.48107 2.763198
C  4.051291 -0.493552 -0.701084
C  -2.749604 -2.483363 -0.202896
C  -1.017459 -1.599685 -1.521587
C  -2.257298 -3.764476 -0.365329
C  -0.476567 -2.853863 -1.711596
C  -1.11232 -3.939209 -1.125522
H  1.150906 3.2885 -0.35362
H  0.235928 1.99146 -1.111852
H  -2.255227 2.505871 -0.850951
H  -2.863372 2.406731 0.806406
H  -1.197109 4.734205 -0.363567
H  -1.853262 4.640492 1.269794
H  -0.120527 4.90132 1.020943
H  -2.849951 0.492047 -1.579758
H  -3.68155 0.009411 -0.111424
H  4.635854 -1.589805 1.059089
H  3.324964 -1.245181 3.147054
H  2.784039 0.416865 3.367732
H  1.628364 -0.822108 2.925275
H  4.75339 -0.835401 -1.446407
H  -2.759473 -4.604138 0.095594
H  0.418148 -2.97909 -2.306248
H  -0.709148 -4.932835 -1.264107
elementType: S F O N C H
totalener: -1461.18488148 hartree
nucrepener: 2158.61017180 hartree
electener: -3619.79505327 hartree
oneelecener: -6296.75823785 hartree
twoeener: 2676.96318458 hartree
cpcmener: -0.03492604 hartree
kineticenergy: 1456.14344915 hartree
xcener: -118.603555503625 hartree
chargesum: -0.0000000
charge: 0.037129 -0.218956 -0.215615 -0.293734 -0.360627 -0.148055 0.335514 -0.135022 -0.094602 0.235777 -0.307607 -0.101614 -0.163083 0.075624 -0.178587 -0.148826 -0.218893 -0.189291 0.321990 0.281859 -0.231858 -0.224397 -0.103435 0.126147 0.113354 0.100579 0.104918 0.104527 0.105987 0.102965 0.107428 0.092792 0.155714 0.099249 0.099475 0.097247 0.166521 0.151172 0.151564 0.166667
qa: 0.0371 -0.2190 -0.2156 -0.2937 -0.3606 -0.1481 0.3355 -0.1350 -0.0946 0.2358 -0.3076 -0.1016 -0.1631 0.0756 -0.1786 -0.1488 -0.2189 -0.1893 0.3220 0.2819 -0.2319 -0.2244 -0.1034 0.1261 0.1134 0.1006 0.1049 0.1045 0.1060 0.1030 0.1074 0.0928 0.1557 0.0992 0.0995 0.0972 0.1665 0.1512 0.1516 0.1667
va: 2.7734 1.0723 1.0716 1.9407 1.9530 2.9301 3.7710 3.9222 4.0479 3.5860 3.9619 3.6140 3.7613 3.8847 3.6499 3.9294 3.9267 4.0274 3.8519 3.8445 3.9370 3.9540 3.8389 1.0128 1.0140 0.9947 1.0015 1.0017 1.0062 1.0061 0.9921 1.0047 1.0001 1.0025 1.0021 1.0048 0.9967 1.0001 1.0013 0.9846
dispcorr: -0.020217190 hartree
energy: -1461.205098667344
dipole: 4.55435 -4.38522 0.16913 10.57717 -10.87235 -0.29518 5.33980 -7.42919 -2.08939
magnitude: 2.11690 au
magnitude: 5.38074 debye
