program: Orca
programVersion: 5.0.2
elementType: S F F O O N C C C C C C C C C C C C C C C C C H H H H H H H H H H H H H H H H H
charge: 0
multiplicity: 1
keywords: wb97x-d3
keywords: def2-TZVPP
keywords: def2/J RIJCOSX
keywords: DEFGRID2
keywords: scfconv7
keywords: smallprint printgap noloewdin
keywords: NOSOSCF
formula: C17H17F2NO2S
InChI: InChI=1/C17H17F2NO2S/c1-11-6-7-23-16(11)15-8-17(2,22-20-15)10-21-9-12-13(18)4-3-5-14(12)19/h3-7H,8-10H2,1-2H3
40 atoms
S  2.86825 0.200075 -1.137897
F  -4.594161 -1.232176 -0.339131
F  0.019918 -2.011821 -0.422724
O  -0.219605 2.35671 1.956242
O  -1.363567 -0.076513 1.321808
N  1.026294 1.788468 1.957715
C  -0.870952 2.164312 0.673018
C  0.264125 1.676622 -0.228739
C  -1.952186 1.112917 0.848582
C  1.324081 1.381835 0.783098
C  -1.476654 3.481297 0.23588
C  2.584309 0.74447 0.477408
C  3.667043 0.488887 1.290406
C  -2.157464 -1.229985 1.147857
C  -2.282297 -1.612196 -0.303484
C  4.715801 -0.145907 0.573112
C  3.766263 0.825257 2.741725
C  4.426327 -0.361605 -0.739984
C  -3.480511 -1.577265 -1.001643
C  -1.164461 -1.966579 -1.049717
C  -3.587779 -1.874197 -2.346989
C  -1.209423 -2.272668 -2.393584
C  -2.437871 -2.22107 -3.037755
H  0.605504 2.452332 -0.920438
H  -0.012413 0.809574 -0.831353
H  -2.438233 0.969879 -0.124539
H  -2.721175 1.470349 1.546787
H  -1.963525 3.367141 -0.732786
H  -2.224661 3.834496 0.946743
H  -0.706775 4.246208 0.134774
H  -3.146946 -1.097462 1.594347
H  -1.666077 -2.02852 1.705357
H  5.654298 -0.429846 1.028884
H  3.686791 1.899093 2.914671
H  2.974065 0.352481 3.322897
H  4.721869 0.49159 3.143393
H  5.051323 -0.822765 -1.489604
H  -4.548335 -1.829496 -2.8421
H  -0.307183 -2.544317 -2.924742
H  -2.498111 -2.453852 -4.091871
elementType: S F O N C H
totalener: -1461.18540861 hartree
nucrepener: 2154.45661459 hartree
electener: -3615.64202320 hartree
oneelecener: -6287.80245105 hartree
twoeener: 2672.16042784 hartree
cpcmener: -0.03519142 hartree
kineticenergy: 1456.14798131 hartree
xcener: -118.606492367521 hartree
chargesum: 0.0000000
charge: 0.036368 -0.221503 -0.216355 -0.293455 -0.361463 -0.149778 0.351525 -0.140620 -0.121641 0.245371 -0.305395 -0.101554 -0.166915 0.046687 -0.145027 -0.151022 -0.218816 -0.188360 0.325381 0.227279 -0.211912 -0.206575 -0.119793 0.128947 0.116135 0.106817 0.108564 0.104104 0.105314 0.103558 0.104025 0.120250 0.155628 0.098765 0.097734 0.098856 0.166890 0.152232 0.152888 0.166864
qa: 0.0364 -0.2215 -0.2164 -0.2935 -0.3615 -0.1498 0.3515 -0.1406 -0.1216 0.2454 -0.3054 -0.1016 -0.1669 0.0467 -0.1450 -0.1510 -0.2188 -0.1884 0.3254 0.2273 -0.2119 -0.2066 -0.1198 0.1289 0.1161 0.1068 0.1086 0.1041 0.1053 0.1036 0.1040 0.1202 0.1556 0.0988 0.0977 0.0989 0.1669 0.1522 0.1529 0.1669
va: 2.7788 1.0627 1.0700 1.9407 1.9545 2.9363 3.7470 3.9297 4.0894 3.5839 3.9651 3.6421 3.7649 3.8908 3.5474 3.9321 3.9277 4.0305 3.8038 3.8772 3.9256 3.9318 3.8521 1.0113 1.0002 0.9821 1.0052 1.0011 1.0068 1.0057 1.0103 0.9917 1.0000 1.0025 1.0041 1.0024 0.9966 0.9990 1.0001 0.9848
dispcorr: -0.020880713 hartree
energy: -1461.206289322987
dipole: 4.73209 -5.29511 -0.56302 11.25901 -11.86795 -0.60894 2.89271 -5.49520 -2.60249
magnitude: 2.73144 au
magnitude: 6.94277 debye
