program: Orca
programVersion: 5.0.2
elementType: S F F O O N C C C C C C C C C C C C C C C C C H H H H H H H H H H H H H H H H H
charge: 0
multiplicity: 1
keywords: wb97x-d3
keywords: def2-TZVPP
keywords: def2/J RIJCOSX
keywords: DEFGRID2
keywords: scfconv7
keywords: smallprint printgap noloewdin
keywords: NOSOSCF
formula: C17H17F2NO2S
InChI: InChI=1/C17H17F2NO2S/c1-11-6-7-23-16(11)15-8-17(2,22-20-15)10-21-9-12-13(18)4-3-5-14(12)19/h3-7H,8-10H2,1-2H3
40 atoms
S  3.101556 -1.230036 0.654224
F  -4.062381 -0.837058 0.61109
F  -0.837066 -0.937697 -2.775835
O  -0.817086 0.509149 1.228921
O  -2.70243 1.543988 -0.674428
N  0.417974 -0.06713 1.105334
C  -0.775887 1.882115 0.771655
C  0.719842 2.197446 0.71203
C  -1.34984 1.946051 -0.640222
C  1.290926 0.819328 0.812649
C  -1.549918 2.726706 1.761207
C  2.67578 0.447192 0.629902
C  3.778858 1.246011 0.435162
C  -3.003345 0.507391 -1.586274
C  -2.497808 -0.832679 -1.123342
C  4.966046 0.469425 0.310653
C  3.798607 2.740911 0.359199
C  4.751566 -0.86948 0.407111
C  -3.047073 -1.454995 -0.009724
C  -1.433065 -1.497807 -1.712408
C  -2.608021 -2.663632 0.486406
C  -0.945148 -2.709237 -1.259102
C  -1.545837 -3.288175 -0.153345
H  1.058477 2.822574 1.542024
H  1.003145 2.704087 -0.211993
H  -0.729373 1.341441 -1.311448
H  -1.26948 2.981556 -0.991379
H  -2.588296 2.405532 1.84669
H  -1.095105 2.673338 2.750672
H  -1.546727 3.770519 1.446322
H  -2.618468 0.736071 -2.583386
H  -4.090558 0.482457 -1.672601
H  5.94213 0.907675 0.155264
H  3.360121 3.205117 1.242087
H  4.824014 3.097695 0.277456
H  3.255223 3.112521 -0.510155
H  5.48281 -1.661516 0.344358
H  -3.079337 -3.104932 1.354098
H  -0.112603 -3.184344 -1.760372
H  -1.180483 -4.235265 0.218999
elementType: S F O N C H
totalener: -1461.18379434 hartree
nucrepener: 2173.31338795 hartree
electener: -3634.49718229 hartree
oneelecener: -6326.25760427 hartree
twoeener: 2691.76042199 hartree
cpcmener: -0.03801021 hartree
kineticenergy: 1456.14494010 hartree
xcener: -118.606897081417 hartree
chargesum: 0.0000000
charge: 0.037268 -0.219715 -0.222243 -0.277992 -0.395186 -0.158414 0.303476 -0.137442 -0.067840 0.193806 -0.303612 -0.077232 -0.116494 0.057439 -0.168048 -0.176032 -0.247639 -0.173546 0.270259 0.343850 -0.228364 -0.239294 -0.105149 0.117758 0.122285 0.108766 0.117367 0.097653 0.101421 0.101537 0.109836 0.115983 0.154455 0.109959 0.105724 0.113771 0.164465 0.151191 0.150090 0.165883
qa: 0.0373 -0.2197 -0.2222 -0.2780 -0.3952 -0.1584 0.3035 -0.1374 -0.0678 0.1938 -0.3036 -0.0772 -0.1165 0.0574 -0.1680 -0.1760 -0.2476 -0.1735 0.2703 0.3439 -0.2284 -0.2393 -0.1051 0.1178 0.1223 0.1088 0.1174 0.0977 0.1014 0.1015 0.1098 0.1160 0.1545 0.1100 0.1057 0.1138 0.1645 0.1512 0.1501 0.1659
va: 2.7880 1.0678 1.0617 1.9568 1.9187 2.9413 3.8108 3.9864 3.9885 3.6820 3.9536 3.5695 3.7260 3.8957 3.5179 3.9462 3.9326 4.0307 3.8657 3.7287 3.9415 3.9306 3.8285 1.0093 1.0037 0.9921 1.0029 1.0199 1.0068 1.0023 1.0057 0.9947 1.0017 0.9932 1.0016 0.9932 0.9969 0.9996 1.0019 0.9843
dispcorr: -0.021906992 hartree
energy: -1461.205701331337
dipole: 10.55154 -8.60038 1.95115 18.77486 -17.35837 1.41649 3.63874 -4.40052 -0.76178
magnitude: 2.52859 au
magnitude: 6.42716 debye
