program: Orca
programVersion: 5.0.2
elementType: S F F O O N C C C C C C C C C C C C C C C C C H H H H H H H H H H H H H H H H H
charge: 0
multiplicity: 1
keywords: wb97x-d3
keywords: def2-TZVPP
keywords: def2/J RIJCOSX
keywords: DEFGRID2
keywords: scfconv7
keywords: smallprint printgap noloewdin
keywords: NOSOSCF
formula: C17H17F2NO2S
InChI: InChI=1/C17H17F2NO2S/c1-11-6-7-23-16(11)15-8-17(2,22-20-15)10-21-9-12-13(18)4-3-5-14(12)19/h3-7H,8-10H2,1-2H3
40 atoms
S  3.074325 -1.242352 0.552205
F  -4.058495 -0.834722 0.595248
F  -0.816974 -0.924305 -2.776797
O  -0.828751 0.502423 1.241557
O  -2.701854 1.546184 -0.665367
N  0.403921 -0.077078 1.113044
C  -0.783203 1.878686 0.795451
C  0.712895 2.190994 0.742271
C  -1.351498 1.95468 -0.618492
C  1.27999 0.809124 0.829413
C  -1.55674 2.717675 1.790033
C  2.661728 0.436809 0.630654
C  3.772186 1.236994 0.490569
C  -2.98672 0.518466 -1.592028
C  -2.484316 -0.824131 -1.131043
C  4.953024 0.460567 0.321221
C  3.802828 2.733485 0.512925
C  4.728112 -0.880306 0.331346
C  -3.03765 -1.448388 -0.020461
C  -1.416092 -1.486322 -1.715697
C  -2.596012 -2.655091 0.477892
C  -0.925529 -2.695593 -1.259613
C  -1.528369 -3.276012 -0.155966
H  1.050789 2.807926 1.578106
H  1.000664 2.702773 -0.177549
H  -0.724918 1.35863 -1.291265
H  -1.273996 2.993331 -0.959809
H  -1.554035 3.762668 1.479804
H  -2.594689 2.395811 1.875305
H  -1.100125 2.659959 2.778244
H  -2.583001 0.756769 -2.578888
H  -4.071735 0.492073 -1.699229
H  5.933012 0.900033 0.196937
H  3.36843 3.140543 1.425541
H  4.830434 3.087759 0.4529
H  3.260289 3.165105 -0.328602
H  5.452938 -1.672718 0.219874
H  -3.070054 -3.09674 1.344001
H  -0.088946 -3.167175 -1.757091
H  -1.16017 -4.220536 0.219881
elementType: S F O N C H
totalener: -1461.18368846 hartree
nucrepener: 2176.10850551 hartree
electener: -3637.29219397 hartree
oneelecener: -6331.84558509 hartree
twoeener: 2694.55339112 hartree
cpcmener: -0.03799747 hartree
kineticenergy: 1456.15167630 hartree
xcener: -118.608277967320 hartree
chargesum: -0.0000000
charge: 0.035850 -0.219656 -0.222511 -0.277635 -0.395588 -0.156723 0.305296 -0.140355 -0.067422 0.187976 -0.302986 -0.071167 -0.117164 0.058281 -0.165732 -0.176615 -0.245447 -0.172263 0.268121 0.343525 -0.227311 -0.238966 -0.106055 0.117073 0.122574 0.108318 0.117455 0.101446 0.097825 0.101351 0.109320 0.116643 0.154228 0.110030 0.105450 0.112001 0.164617 0.150934 0.149427 0.165856
qa: 0.0358 -0.2197 -0.2225 -0.2776 -0.3956 -0.1567 0.3053 -0.1404 -0.0674 0.1880 -0.3030 -0.0712 -0.1172 0.0583 -0.1657 -0.1766 -0.2454 -0.1723 0.2681 0.3435 -0.2273 -0.2390 -0.1061 0.1171 0.1226 0.1083 0.1175 0.1014 0.0978 0.1014 0.1093 0.1166 0.1542 0.1100 0.1054 0.1120 0.1646 0.1509 0.1494 0.1659
va: 2.7882 1.0679 1.0615 1.9584 1.9185 2.9431 3.8099 3.9876 3.9928 3.6890 3.9529 3.5668 3.7242 3.8954 3.5177 3.9477 3.9336 4.0305 3.8678 3.7290 3.9403 3.9266 3.8287 1.0094 1.0039 0.9917 1.0030 1.0023 1.0195 1.0068 1.0063 0.9946 1.0017 0.9939 1.0018 0.9933 0.9968 0.9997 1.0026 0.9843
dispcorr: -0.022014761 hartree
energy: -1461.205703222834
dipole: 10.60667 -8.63465 1.97202 18.78132 -17.34844 1.43288 4.24957 -4.96003 -0.71046
magnitude: 2.53905 au
magnitude: 6.45374 debye
