program: Orca
programVersion: 5.0.2
elementType: S F F O O N C C C C C C C C C C C C C C C C C H H H H H H H H H H H H H H H H H
charge: 0
multiplicity: 1
keywords: wb97x-d3
keywords: def2-TZVPP
keywords: def2/J RIJCOSX
keywords: DEFGRID2
keywords: scfconv7
keywords: smallprint printgap noloewdin
keywords: NOSOSCF
formula: C17H17F2NO2S
InChI: InChI=1/C17H17F2NO2S/c1-11-6-7-23-16(11)15-8-17(2,22-20-15)10-21-9-12-13(18)4-3-5-14(12)19/h3-7H,8-10H2,1-2H3
40 atoms
S  3.385681 0.77134 -1.093933
F  -4.74198 -1.201353 0.227457
F  -0.432268 -2.328281 -1.204039
O  -0.13843 1.970585 2.052887
O  -1.11224 -0.412204 0.976448
N  1.178872 1.609866 2.054472
C  -0.694669 1.919279 0.710279
C  0.519919 1.612281 -0.171721
C  -1.735074 0.816555 0.686375
C  1.579413 1.39414 0.860015
C  -1.336822 3.257477 0.405619
C  2.937746 1.004047 0.558171
C  4.000123 0.76942 1.404014
C  -1.993993 -1.513576 0.960635
C  -2.560784 -1.780566 -0.409699
C  5.167022 0.405504 0.680598
C  3.974086 0.873886 2.89318
C  4.985071 0.368577 -0.668293
C  -3.900084 -1.611955 -0.731235
C  -1.738503 -2.169823 -1.459973
C  -4.415857 -1.838724 -1.993026
C  -2.193171 -2.403458 -2.740902
C  -3.547506 -2.237068 -2.996631
H  0.777917 2.452039 -0.822562
H  0.376034 0.739368 -0.812368
H  -2.203154 0.808871 -0.305939
H  -2.525964 1.034553 1.417084
H  -2.145263 3.481281 1.1028
H  -0.600826 4.059702 0.460579
H  -1.753026 3.255453 -0.601858
H  -2.802595 -1.372217 1.683831
H  -1.415804 -2.374504 1.298869
H  6.109851 0.179573 1.159717
H  4.942664 0.596952 3.307311
H  3.746414 1.888227 3.224576
H  3.219635 0.220674 3.333236
H  5.71205 0.121901 -1.427213
H  -5.471712 -1.700122 -2.184167
H  -1.507979 -2.708057 -3.520705
H  -3.92913 -2.417043 -3.992278
elementType: S F O N C H
totalener: -1461.18612784 hartree
nucrepener: 2094.36674836 hartree
electener: -3555.55287620 hartree
oneelecener: -6167.55694537 hartree
twoeener: 2612.00406916 hartree
cpcmener: -0.03375390 hartree
kineticenergy: 1456.14348061 hartree
xcener: -118.605075621923 hartree
chargesum: -0.0000000
charge: 0.035701 -0.220811 -0.218996 -0.287694 -0.357152 -0.149355 0.321819 -0.126332 -0.090956 0.269278 -0.315471 -0.110502 -0.179484 0.038698 -0.202009 -0.148072 -0.219883 -0.187986 0.353300 0.278154 -0.225005 -0.231143 -0.105917 0.124165 0.116381 0.101728 0.107275 0.105565 0.106313 0.103867 0.105010 0.118008 0.155090 0.099407 0.098695 0.098356 0.166630 0.152388 0.153046 0.167897
qa: 0.0357 -0.2208 -0.2190 -0.2877 -0.3572 -0.1494 0.3218 -0.1263 -0.0910 0.2693 -0.3155 -0.1105 -0.1795 0.0387 -0.2020 -0.1481 -0.2199 -0.1880 0.3533 0.2782 -0.2250 -0.2311 -0.1059 0.1242 0.1164 0.1017 0.1073 0.1056 0.1063 0.1039 0.1050 0.1180 0.1551 0.0994 0.0987 0.0984 0.1666 0.1524 0.1530 0.1679
va: 2.7811 1.0641 1.0698 1.9450 1.9452 2.9459 3.7909 3.9144 4.0403 3.5812 3.9809 3.6482 3.7769 3.8983 3.5404 3.9323 3.9293 4.0310 3.7721 3.8818 3.9368 3.9390 3.8280 1.0113 1.0158 0.9882 1.0044 1.0062 1.0033 1.0018 1.0108 0.9901 1.0002 1.0022 1.0024 1.0036 0.9968 0.9997 0.9994 0.9844
dispcorr: -0.019311201 hartree
energy: -1461.205439042003
dipole: 5.35465 -6.06482 -0.71017 11.04103 -11.32767 -0.28664 3.99148 -6.39266 -2.40118
magnitude: 2.52035 au
magnitude: 6.40623 debye
