program: Orca
programVersion: 5.0.2
elementType: S F F O O N C C C C C C C C C C C C C C C C C H H H H H H H H H H H H H H H H H
charge: 0
multiplicity: 1
keywords: wb97x-d3
keywords: def2-TZVPP
keywords: def2/J RIJCOSX
keywords: DEFGRID2
keywords: scfconv7
keywords: smallprint printgap noloewdin
keywords: NOSOSCF
formula: C17H17F2NO2S
InChI: InChI=1/C17H17F2NO2S/c1-11-6-7-23-16(11)15-8-17(2,22-20-15)10-21-9-12-13(18)4-3-5-14(12)19/h3-7H,8-10H2,1-2H3
40 atoms
S  2.550453 -1.024515 1.564415
F  -3.614573 -1.2232 0.663977
F  -0.145342 -0.627922 -2.420652
O  -1.254481 1.034735 1.394534
O  -2.053525 1.48752 -1.57656
N  -0.082707 0.339825 1.443938
C  -1.107294 2.237703 0.593517
C  0.290385 2.100677 -0.017622
C  -2.232355 2.296487 -0.436802
C  0.782124 0.867121 0.666496
C  -1.222072 3.426411 1.533066
C  2.087585 0.265708 0.510046
C  3.063758 0.529306 -0.423262
C  -2.694201 0.230559 -1.597701
C  -1.926998 -0.876375 -0.923327
C  4.185578 -0.331559 -0.259356
C  3.003944 1.552315 -1.514002
C  4.046825 -1.214018 0.765786
C  -2.41667 -1.574225 0.169731
C  -0.675766 -1.278012 -1.371868
C  -1.742177 -2.615309 0.776106
C  0.048176 -2.306946 -0.806776
C  -0.500755 -2.976482 0.275993
H  0.925107 2.958452 0.211627
H  0.281505 1.987259 -1.101684
H  -2.285959 3.327251 -0.797553
H  -3.187996 2.082944 0.059049
H  -1.063356 4.35847 0.990631
H  -2.208168 3.471946 1.998842
H  -0.472609 3.367829 2.323236
H  -2.824098 -0.022181 -2.652476
H  -3.698262 0.304611 -1.172596
H  5.059884 -0.286076 -0.894023
H  3.942676 1.56799 -2.065467
H  2.209888 1.33384 -2.22915
H  2.833289 2.558105 -1.13129
H  4.753623 -1.96101 1.094461
H  -2.175563 -3.125704 1.625746
H  1.02077 -2.5718 -1.19896
H  0.048263 -3.784926 0.738629
elementType: S F O N C H
totalener: -1461.18102571 hartree
nucrepener: 2271.24911453 hartree
electener: -3732.43014024 hartree
oneelecener: -6521.86821868 hartree
twoeener: 2789.43807844 hartree
cpcmener: -0.03065462 hartree
kineticenergy: 1456.15404208 hartree
xcener: -118.612729167099 hartree
chargesum: -0.0000000
charge: 0.036714 -0.225104 -0.224882 -0.285529 -0.381559 -0.113046 0.311566 -0.135746 -0.019191 0.164496 -0.337098 -0.095052 -0.119283 0.017371 -0.172740 -0.174818 -0.258051 -0.181906 0.348664 0.352173 -0.239755 -0.260504 -0.101732 0.126118 0.114590 0.112488 0.099043 0.098622 0.109030 0.108366 0.119603 0.106955 0.153589 0.105073 0.110188 0.112661 0.164472 0.147884 0.144861 0.161468
qa: 0.0367 -0.2251 -0.2249 -0.2855 -0.3816 -0.1130 0.3116 -0.1357 -0.0192 0.1645 -0.3371 -0.0951 -0.1193 0.0174 -0.1727 -0.1748 -0.2581 -0.1819 0.3487 0.3522 -0.2398 -0.2605 -0.1017 0.1261 0.1146 0.1125 0.0990 0.0986 0.1090 0.1084 0.1196 0.1070 0.1536 0.1051 0.1102 0.1127 0.1645 0.1479 0.1449 0.1615
va: 2.7715 1.0589 1.0619 1.9573 1.9308 2.9206 3.8025 3.9728 3.9205 3.6569 3.9970 3.5516 3.7358 3.9232 3.5509 3.9395 3.9338 4.0263 3.7661 3.7354 3.9542 3.9253 3.7950 1.0075 1.0334 0.9993 1.0104 1.0043 1.0042 1.0005 0.9925 1.0093 1.0017 1.0032 0.9976 0.9912 0.9967 0.9997 1.0012 0.9884
dispcorr: -0.025779008 hartree
energy: -1461.206804721502
dipole: 6.51846 -5.46836 1.05011 16.52250 -15.61686 0.90564 -2.56759 1.72860 -0.83899
magnitude: 1.62075 au
magnitude: 4.11961 debye
