program: Orca
programVersion: 5.0.2
elementType: S F F O O N C C C C C C C C C C C C C C C C C H H H H H H H H H H H H H H H H H
charge: 0
multiplicity: 1
keywords: wb97x-d3
keywords: def2-TZVPP
keywords: def2/J RIJCOSX
keywords: DEFGRID2
keywords: scfconv7
keywords: smallprint printgap noloewdin
keywords: NOSOSCF
formula: C17H17F2NO2S
InChI: InChI=1/C17H17F2NO2S/c1-11-6-7-23-16(11)15-8-17(2,22-20-15)10-21-9-12-13(18)4-3-5-14(12)19/h3-7H,8-10H2,1-2H3
40 atoms
S  3.520685 0.793427 -1.028036
F  -4.690049 -1.424173 0.518749
F  -0.560655 -2.155501 -1.55698
O  -0.128602 1.928412 1.996401
O  -0.996239 -0.465462 0.81765
N  1.1929 1.58854 2.047054
C  -0.631163 1.881656 0.634075
C  0.622668 1.614211 -0.203362
C  -1.644833 0.755784 0.556612
C  1.645005 1.396737 0.867142
C  -1.295309 3.207382 0.320023
C  3.019395 1.034254 0.610296
C  4.063254 0.835699 1.487723
C  -1.859034 -1.580189 0.855881
C  -2.587015 -1.80568 -0.444146
C  5.258915 0.491245 0.802521
C  3.987485 0.957656 2.973878
C  5.11634 0.432871 -0.550089
C  -3.96542 -1.713983 -0.570851
C  -1.897099 -2.078578 -1.618832
C  -4.635917 -1.904497 -1.763904
C  -2.510149 -2.268127 -2.839523
C  -3.893596 -2.181918 -2.900076
H  0.891657 2.46965 -0.828746
H  0.52187 0.749773 -0.86305
H  -2.096339 0.767203 -0.443577
H  -2.452846 0.93546 1.279667
H  -0.583192 4.027767 0.410364
H  -1.673902 3.205052 -0.702214
H  -2.134899 3.402349 0.988437
H  -2.576605 -1.484291 1.675758
H  -1.231753 -2.442887 1.08471
H  6.192648 0.294792 1.3113
H  4.95823 0.748186 3.421244
H  3.683854 1.958223 3.283118
H  3.263983 0.262488 3.401185
H  5.868734 0.194803 -1.286653
H  -5.714045 -1.829337 -1.801863
H  -1.919914 -2.478045 -3.721167
H  -4.397533 -2.330809 -3.845017
elementType: S F O N C H
totalener: -1461.18567121 hartree
nucrepener: 2086.71744128 hartree
electener: -3547.90311249 hartree
oneelecener: -6152.24707271 hartree
twoeener: 2604.34396022 hartree
cpcmener: -0.03317670 hartree
kineticenergy: 1456.14988576 hartree
xcener: -118.606679123148 hartree
chargesum: -0.0000000
charge: 0.035117 -0.221197 -0.218135 -0.287349 -0.356823 -0.149752 0.320366 -0.122033 -0.084728 0.269772 -0.315206 -0.113899 -0.178028 0.040304 -0.208937 -0.148312 -0.219015 -0.186653 0.355944 0.284496 -0.229330 -0.229799 -0.104541 0.123298 0.114351 0.096891 0.107957 0.106189 0.103362 0.105844 0.102641 0.117238 0.155157 0.099734 0.097799 0.098780 0.166550 0.151918 0.152898 0.167132
qa: 0.0351 -0.2212 -0.2181 -0.2873 -0.3568 -0.1498 0.3204 -0.1220 -0.0847 0.2698 -0.3152 -0.1139 -0.1780 0.0403 -0.2089 -0.1483 -0.2190 -0.1867 0.3559 0.2845 -0.2293 -0.2298 -0.1045 0.1233 0.1144 0.0969 0.1080 0.1062 0.1034 0.1058 0.1026 0.1172 0.1552 0.0997 0.0978 0.0988 0.1666 0.1519 0.1529 0.1671
va: 2.7781 1.0649 1.0713 1.9439 1.9447 2.9466 3.7965 3.9088 4.0291 3.5741 3.9801 3.6485 3.7776 3.9050 3.5524 3.9328 3.9291 4.0306 3.7779 3.8729 3.9395 3.9385 3.8293 1.0120 1.0201 0.9906 1.0038 1.0034 1.0018 1.0060 1.0116 0.9884 1.0004 1.0022 1.0031 1.0032 0.9968 0.9999 0.9995 0.9847
dispcorr: -0.019218715 hartree
energy: -1461.204889927158
dipole: 5.40165 -6.12282 -0.72117 11.23160 -11.46760 -0.23599 4.07513 -6.38987 -2.31473
magnitude: 2.43593 au
magnitude: 6.19165 debye
