program: Orca
programVersion: 5.0.2
elementType: S F F O O N C C C C C C C C C C C C C C C C C H H H H H H H H H H H H H H H H H
charge: 0
multiplicity: 1
keywords: wb97x-d3
keywords: def2-TZVPP
keywords: def2/J RIJCOSX
keywords: DEFGRID2
keywords: scfconv7
keywords: smallprint printgap noloewdin
keywords: NOSOSCF
formula: C17H17F2NO2S
InChI: InChI=1/C17H17F2NO2S/c1-11-6-7-23-16(11)15-8-17(2,22-20-15)10-21-9-12-13(18)4-3-5-14(12)19/h3-7H,8-10H2,1-2H3
40 atoms
S  3.719811 0.305823 -0.675193
F  -0.785717 -2.835878 -0.714228
F  -4.757402 -0.414524 -0.212012
O  -0.140897 2.3584 1.479202
O  -1.171822 -0.117839 0.704284
N  1.102349 1.892005 1.801862
C  -0.459466 2.07928 0.089809
C  0.850615 1.523652 -0.475102
C  -1.592579 1.069736 0.073453
C  1.677204 1.413744 0.765367
C  -0.895692 3.370538 -0.572878
C  3.012912 0.862931 0.800947
C  3.876375 0.702652 1.862477
C  -2.20952 -1.054616 0.903984
C  -2.745575 -1.6037 -0.391504
C  5.107859 0.128389 1.447165
C  3.592186 1.074073 3.28023
C  5.164815 -0.135399 0.112568
C  -1.986297 -2.461434 -1.177428
C  -3.979716 -1.248389 -0.917237
C  -2.405127 -2.954781 -2.395366
C  -4.449585 -1.702936 -2.134467
C  -3.647835 -2.560638 -2.870458
H  1.313896 2.211539 -1.188334
H  0.727936 0.565823 -0.985161
H  -1.882923 0.891389 -0.970247
H  -2.466064 1.495487 0.587178
H  -1.120546 3.196007 -1.625189
H  -1.789447 3.782426 -0.102281
H  -0.103074 4.117423 -0.5218
H  -3.019684 -0.613131 1.491694
H  -1.786502 -1.8587 1.50648
H  5.921085 -0.079726 2.128682
H  4.417466 0.772378 3.923939
H  3.453324 2.1499 3.396162
H  2.683863 0.597941 3.650626
H  5.982266 -0.568666 -0.443592
H  -1.773866 -3.626907 -2.960766
H  -5.418513 -1.388585 -2.498071
H  -3.995271 -2.928388 -3.826005
elementType: S F O N C H
totalener: -1461.18623602 hartree
nucrepener: 2081.67273085 hartree
electener: -3542.85896687 hartree
oneelecener: -6142.19485416 hartree
twoeener: 2599.33588729 hartree
cpcmener: -0.03338115 hartree
kineticenergy: 1456.13994771 hartree
xcener: -118.604205249400 hartree
chargesum: -0.0000000
charge: 0.035609 -0.218673 -0.219811 -0.288382 -0.359959 -0.149338 0.310189 -0.117490 -0.077746 0.266410 -0.314679 -0.113443 -0.176986 0.040490 -0.214691 -0.150127 -0.215833 -0.187465 0.284676 0.354225 -0.234641 -0.220312 -0.104162 0.123514 0.117462 0.099099 0.105987 0.103822 0.105224 0.106069 0.107169 0.114363 0.155272 0.098873 0.099556 0.096277 0.167089 0.152949 0.152356 0.167061
qa: 0.0356 -0.2187 -0.2198 -0.2884 -0.3600 -0.1493 0.3102 -0.1175 -0.0777 0.2664 -0.3147 -0.1134 -0.1770 0.0405 -0.2147 -0.1501 -0.2158 -0.1875 0.2847 0.3542 -0.2346 -0.2203 -0.1042 0.1235 0.1175 0.0991 0.1060 0.1038 0.1052 0.1061 0.1072 0.1144 0.1553 0.0989 0.0996 0.0963 0.1671 0.1529 0.1524 0.1671
va: 2.7792 1.0712 1.0656 1.9436 1.9451 2.9435 3.8314 3.9021 4.0174 3.5804 3.9773 3.6494 3.7794 3.9013 3.5396 3.9344 3.9285 4.0301 3.8828 3.7667 3.9341 3.9385 3.8284 1.0113 1.0167 0.9916 1.0036 1.0020 1.0059 1.0036 1.0082 0.9915 1.0001 1.0022 1.0022 1.0046 0.9966 0.9992 0.9997 0.9846
dispcorr: -0.019011382 hartree
energy: -1461.205247404620
dipole: 6.23624 -6.64816 -0.41192 11.17315 -11.83829 -0.66514 2.24844 -4.54276 -2.29432
magnitude: 2.42405 au
magnitude: 6.16144 debye
