program: Orca
programVersion: 5.0.2
elementType: S F F O O N C C C C C C C C C C C C C C C C C H H H H H H H H H H H H H H H H H
charge: 0
multiplicity: 1
keywords: wb97x-d3
keywords: def2-TZVPP
keywords: def2/J RIJCOSX
keywords: DEFGRID2
keywords: scfconv7
keywords: smallprint printgap noloewdin
keywords: NOSOSCF
formula: C17H17F2NO2S
InChI: InChI=1/C17H17F2NO2S/c1-11-6-7-23-16(11)15-8-17(2,22-20-15)10-21-9-12-13(18)4-3-5-14(12)19/h3-7H,8-10H2,1-2H3
40 atoms
S  2.958287 1.243175 -0.742003
F  -0.073543 -0.209139 -2.061631
F  -3.275641 -2.624414 0.341617
O  -0.790694 2.252433 2.203644
O  -1.844116 0.695588 0.211751
N  0.270749 1.383621 2.093962
C  -1.088112 2.835386 0.907654
C  0.21221 2.62297 0.137989
C  -2.232117 2.045041 0.284463
C  0.821939 1.524385 0.950216
C  -1.47887 4.283594 1.099676
C  1.899847 0.673976 0.500507
C  2.204134 -0.615526 0.870888
C  -2.519868 -0.094073 -0.740986
C  -1.723953 -1.358912 -0.872111
C  3.318505 -1.115316 0.141636
C  1.44604 -1.438553 1.859379
C  3.826581 -0.225197 -0.753205
C  -0.483064 -1.35314 -1.497664
C  -2.096885 -2.562484 -0.293014
C  0.340974 -2.45648 -1.571448
C  -1.314538 -3.701007 -0.335014
C  -0.088873 -3.635483 -0.979261
H  0.853224 3.510149 0.156869
H  0.05527 2.354965 -0.906231
H  -2.434903 2.457328 -0.712576
H  -3.147153 2.161962 0.880468
H  -1.693806 4.743112 0.13475
H  -2.371162 4.377856 1.719276
H  -0.671583 4.847275 1.566484
H  -2.579727 0.421816 -1.706132
H  -3.548225 -0.302566 -0.432804
H  3.714725 -2.112053 0.27697
H  1.696305 -1.174084 2.887018
H  0.369905 -1.306278 1.74948
H  1.674643 -2.495072 1.728133
H  4.663376 -0.359959 -1.421426
H  1.297035 -2.392858 -2.073248
H  -1.655817 -4.614975 0.131603
H  0.54023 -4.513826 -1.020318
elementType: S F O N C H
totalener: -1461.18305983 hartree
nucrepener: 2235.46477276 hartree
electener: -3696.64783259 hartree
oneelecener: -6450.30052024 hartree
twoeener: 2753.65268766 hartree
cpcmener: -0.03466003 hartree
kineticenergy: 1456.16145404 hartree
xcener: -118.607902230683 hartree
chargesum: -0.0000000
charge: 0.038619 -0.215956 -0.219384 -0.297035 -0.351119 -0.133091 0.342697 -0.144535 -0.096120 0.156479 -0.298188 -0.004556 -0.181516 0.064417 -0.191539 -0.175077 -0.249523 -0.172700 0.296227 0.330775 -0.214220 -0.221372 -0.119043 0.124331 0.115123 0.098717 0.104666 0.104675 0.104985 0.100446 0.107222 0.092586 0.157049 0.118443 0.090913 0.102299 0.167052 0.150129 0.151977 0.165148
qa: 0.0386 -0.2160 -0.2194 -0.2970 -0.3511 -0.1331 0.3427 -0.1445 -0.0961 0.1565 -0.2982 -0.0046 -0.1815 0.0644 -0.1915 -0.1751 -0.2495 -0.1727 0.2962 0.3308 -0.2142 -0.2214 -0.1190 0.1243 0.1151 0.0987 0.1047 0.1047 0.1050 0.1004 0.1072 0.0926 0.1570 0.1184 0.0909 0.1023 0.1671 0.1501 0.1520 0.1651
va: 2.7657 1.0724 1.0722 1.9509 1.9596 2.9226 3.7902 3.9297 4.0428 3.7018 3.9457 3.6192 3.7574 3.9122 3.6527 3.9297 3.9342 4.0240 3.7938 3.8498 3.8885 3.9201 3.8246 1.0105 1.0180 0.9953 1.0014 1.0013 1.0065 1.0080 0.9962 1.0008 1.0001 1.0025 1.0095 0.9999 0.9953 1.0002 0.9985 0.9866
dispcorr: -0.024631852 hartree
energy: -1461.207691679033
dipole: -0.14644 0.31039 0.16395 7.75835 -7.97093 -0.21258 3.97786 -6.21721 -2.23935
magnitude: 2.25538 au
magnitude: 5.73273 debye
