program: Orca
programVersion: 5.0.2
elementType: S F F O O N C C C C C C C C C C C C C C C C C H H H H H H H H H H H H H H H H H
charge: 0
multiplicity: 1
keywords: wb97x-d3
keywords: def2-TZVPP
keywords: def2/J RIJCOSX
keywords: DEFGRID2
keywords: scfconv7
keywords: smallprint printgap noloewdin
keywords: NOSOSCF
formula: C17H17F2NO2S
InChI: InChI=1/C17H17F2NO2S/c1-11-6-7-23-16(11)15-8-17(2,22-20-15)10-21-9-12-13(18)4-3-5-14(12)19/h3-7H,8-10H2,1-2H3
40 atoms
S  3.059992 0.947957 -0.834818
F  -3.38005 -2.386022 0.67596
F  -0.190871 -0.385479 -2.099614
O  -0.596414 2.539393 1.969835
O  -1.785653 0.831654 0.172169
N  0.404474 1.596154 1.955628
C  -0.877436 2.983073 0.615378
C  0.393769 2.594493 -0.134875
C  -2.08314 2.205296 0.103526
C  0.94492 1.564554 0.798626
C  -1.164753 4.468112 0.637456
C  1.954878 0.592687 0.445981
C  2.151807 -0.673652 0.946367
C  -2.545491 -0.004988 -0.672462
C  -1.826519 -1.321006 -0.718205
C  3.223011 -1.332292 0.281584
C  1.328949 -1.330274 2.005293
C  3.802237 -0.582021 -0.694343
C  -2.231525 -2.44407 -0.012332
C  -0.623316 -1.444977 -1.402557
C  -1.511649 -3.623253 0.017443
C  0.139999 -2.593528 -1.407063
C  -0.318271 -3.686307 -0.684561
H  1.089189 3.434664 -0.229327
H  0.202947 2.212344 -1.136961
H  -2.283765 2.518919 -0.929298
H  -2.973748 2.447586 0.698645
H  -1.34977 4.828127 -0.374664
H  -2.044737 4.697247 1.239345
H  -0.316547 5.022004 1.039227
H  -2.621488 0.421932 -1.679186
H  -3.568725 -0.123163 -0.304393
H  3.536775 -2.338965 0.520557
H  0.267272 -1.118767 1.8784
H  1.46671 -2.410147 1.97621
H  1.604773 -0.99073 3.004077
H  4.626344 -0.852217 -1.337106
H  -1.87747 -4.47067 0.581106
H  1.070737 -2.630881 -1.956852
H  0.261496 -4.598711 -0.670857
elementType: S F O N C H
totalener: -1461.18338598 hartree
nucrepener: 2231.72331359 hartree
electener: -3692.90669957 hartree
oneelecener: -6442.81256702 hartree
twoeener: 2749.90586745 hartree
cpcmener: -0.03477168 hartree
kineticenergy: 1456.15050616 hartree
xcener: -118.605231374573 hartree
chargesum: -0.0000000
charge: 0.039340 -0.219305 -0.217092 -0.297046 -0.351935 -0.133552 0.344767 -0.147457 -0.096581 0.159682 -0.299864 -0.006451 -0.184649 0.063910 -0.191525 -0.170390 -0.251531 -0.172640 0.331426 0.297866 -0.222616 -0.218675 -0.115635 0.124482 0.116233 0.098617 0.104397 0.105279 0.104968 0.101166 0.106795 0.093227 0.156340 0.091965 0.103066 0.118449 0.166306 0.152251 0.151310 0.165101
qa: 0.0393 -0.2193 -0.2171 -0.2970 -0.3519 -0.1336 0.3448 -0.1475 -0.0966 0.1597 -0.2999 -0.0065 -0.1846 0.0639 -0.1915 -0.1704 -0.2515 -0.1726 0.3314 0.2979 -0.2226 -0.2187 -0.1156 0.1245 0.1162 0.0986 0.1044 0.1053 0.1050 0.1012 0.1068 0.0932 0.1563 0.0920 0.1031 0.1184 0.1663 0.1523 0.1513 0.1651
va: 2.7657 1.0722 1.0698 1.9508 1.9587 2.9214 3.7858 3.9338 4.0435 3.6995 3.9468 3.6260 3.7575 3.9103 3.6434 3.9320 3.9324 4.0228 3.8445 3.7897 3.9200 3.8915 3.8216 1.0101 1.0182 0.9954 1.0016 1.0012 1.0064 1.0078 0.9966 1.0007 1.0003 1.0095 0.9997 1.0021 0.9956 0.9986 1.0000 0.9864
dispcorr: -0.024509555 hartree
energy: -1461.207895534656
dipole: 0.29043 -0.19444 0.09599 8.08406 -8.56154 -0.47748 3.07247 -5.29354 -2.22107
magnitude: 2.27384 au
magnitude: 5.77965 debye
