program: Orca
programVersion: 5.0.2
elementType: S F F O O N C C C C C C C C C C C C C C C C C H H H H H H H H H H H H H H H H H
charge: 0
multiplicity: 1
keywords: wb97x-d3
keywords: def2-TZVPP
keywords: def2/J RIJCOSX
keywords: DEFGRID2
keywords: scfconv7
keywords: smallprint printgap noloewdin
keywords: NOSOSCF
formula: C17H17F2NO2S
InChI: InChI=1/C17H17F2NO2S/c1-11-6-7-23-16(11)15-8-17(2,22-20-15)10-21-9-12-13(18)4-3-5-14(12)19/h3-7H,8-10H2,1-2H3
40 atoms
S  3.084214 0.958781 -0.843583
F  -3.281286 -1.410331 1.107746
F  -0.584487 -0.540306 -2.617524
O  -1.215048 1.08706 1.421525
O  -2.309615 1.414126 -1.435366
N  -0.024414 0.421167 1.507979
C  -1.088941 2.248585 0.559876
C  0.240756 2.017972 -0.156026
C  -2.302648 2.321089 -0.359601
C  0.799323 0.887642 0.649537
C  -1.057351 3.482215 1.447537
C  2.122981 0.341986 0.455388
C  2.778571 -0.66448 1.130192
C  -2.928274 0.162568 -1.235197
C  -1.984262 -0.919021 -0.780175
C  4.060244 -0.914735 0.570591
C  2.250735 -1.409541 2.311131
C  4.357331 -0.118411 -0.493378
C  -2.199626 -1.678518 0.359395
C  -0.840154 -1.236653 -1.499362
C  -1.361715 -2.696476 0.767938
C  0.042632 -2.232547 -1.13393
C  -0.233881 -2.967694 0.008896
H  0.882049 2.900979 -0.1224
H  0.132954 1.735085 -1.20559
H  -2.313925 3.319739 -0.802833
H  -3.215713 2.228835 0.242079
H  -0.903843 4.378701 0.846701
H  -1.992785 3.600639 1.996965
H  -0.242016 3.421612 2.169542
H  -3.357303 -0.12738 -2.197335
H  -3.765164 0.252285 -0.538608
H  4.734528 -1.667407 0.955445
H  2.952598 -2.183851 2.617637
H  2.091679 -0.74856 3.16658
H  1.292945 -1.88584 2.100708
H  5.258817 -0.112388 -1.087226
H  -1.582887 -3.25985 1.664528
H  0.920066 -2.431997 -1.734125
H  0.438544 -3.758259 0.311858
elementType: S F O N C H
totalener: -1461.18222606 hartree
nucrepener: 2263.77395971 hartree
electener: -3724.95618577 hartree
oneelecener: -6506.86546594 hartree
twoeener: 2781.90928017 hartree
cpcmener: -0.02935300 hartree
kineticenergy: 1456.14862933 hartree
xcener: -118.611686424650 hartree
chargesum: 0.0000000
charge: 0.036509 -0.224598 -0.220684 -0.286509 -0.381847 -0.116517 0.298874 -0.159424 -0.011522 0.274980 -0.337290 -0.146034 -0.195310 0.030214 -0.132953 -0.136647 -0.233346 -0.191734 0.331345 0.311342 -0.215819 -0.249932 -0.142377 0.130137 0.120319 0.110867 0.100072 0.098672 0.107677 0.110287 0.122376 0.105485 0.154546 0.101895 0.106959 0.095760 0.166583 0.149047 0.147442 0.171154
qa: 0.0365 -0.2246 -0.2207 -0.2865 -0.3818 -0.1165 0.2989 -0.1594 -0.0115 0.2750 -0.3373 -0.1460 -0.1953 0.0302 -0.1330 -0.1366 -0.2333 -0.1917 0.3313 0.3113 -0.2158 -0.2499 -0.1424 0.1301 0.1203 0.1109 0.1001 0.0987 0.1077 0.1103 0.1224 0.1055 0.1545 0.1019 0.1070 0.0958 0.1666 0.1490 0.1474 0.1712
va: 2.7779 1.0611 1.0688 1.9500 1.9395 2.9095 3.7714 3.9378 3.9314 3.5113 3.9981 3.6125 3.7373 3.9250 3.5215 3.9250 3.9318 4.0351 3.7948 3.7986 3.8912 3.8798 3.7941 1.0111 1.0317 0.9980 1.0095 1.0050 1.0044 0.9992 0.9904 1.0110 1.0000 1.0038 1.0004 1.0031 0.9968 0.9996 1.0021 0.9824
dispcorr: -0.025663632 hartree
energy: -1461.207889688765
dipole: 4.60725 -3.59494 1.01231 6.93244 -6.70280 0.22963 9.09275 -9.25515 -0.16240
magnitude: 1.05066 au
magnitude: 2.67056 debye
