program: Orca
programVersion: 5.0.2
elementType: S F F O O N C C C C C C C C C C C C C C C C C H H H H H H H H H H H H H H H H H
charge: 0
multiplicity: 1
keywords: wb97x-d3
keywords: def2-TZVPP
keywords: def2/J RIJCOSX
keywords: DEFGRID2
keywords: scfconv7
keywords: smallprint printgap noloewdin
keywords: NOSOSCF
formula: C17H17F2NO2S
InChI: InChI=1/C17H17F2NO2S/c1-11-6-7-23-16(11)15-8-17(2,22-20-15)10-21-9-12-13(18)4-3-5-14(12)19/h3-7H,8-10H2,1-2H3
40 atoms
S  3.580538 2.560343 -0.660751
F  -4.710168 -0.339706 -1.032679
F  -0.724475 -2.790383 -1.043218
O  -0.07909 0.47496 1.791405
O  -1.025698 0.23572 -0.837269
N  1.252231 0.287629 1.555423
C  -0.58811 1.620344 1.054267
C  0.65368 2.184428 0.357276
C  -1.638663 1.098185 0.092058
C  1.69441 1.1931 0.769207
C  -1.203766 2.592463 2.040954
C  3.075158 1.249815 0.347537
C  4.121195 0.395765 0.621642
C  -1.932705 -0.375268 -1.729539
C  -2.680105 -1.510356 -1.080287
C  5.322416 0.831486 0.001248
C  4.043502 -0.84149 1.453871
C  5.181353 1.979625 -0.716514
C  -4.023222 -1.453211 -0.738022
C  -2.026008 -2.688213 -0.739993
C  -4.69331 -2.485011 -0.108188
C  -2.642981 -3.754345 -0.120594
C  -3.98917 -3.638993 0.196087
H  0.902418 3.186899 0.714751
H  0.55084 2.245579 -0.727886
H  -2.116014 1.945576 -0.416593
H  -2.419012 0.583054 0.668331
H  -1.574038 3.474584 1.518559
H  -2.039598 2.14392 2.579404
H  -0.461976 2.922891 2.768341
H  -1.342682 -0.749418 -2.566811
H  -2.631095 0.358467 -2.142074
H  6.259256 0.299467 0.092875
H  3.758574 -0.620663 2.482926
H  3.30554 -1.544252 1.065799
H  5.008316 -1.345691 1.474397
H  5.93768 2.508799 -1.276057
H  -5.741801 -2.385888 0.138324
H  -2.085045 -4.651384 0.111759
H  -4.494241 -4.459783 0.686228
elementType: S F O N C H
totalener: -1461.18636947 hartree
nucrepener: 2078.90497418 hartree
electener: -3540.09134365 hartree
oneelecener: -6137.23607974 hartree
twoeener: 2597.14473610 hartree
cpcmener: -0.03440749 hartree
kineticenergy: 1456.14545973 hartree
xcener: -118.604753542578 hartree
chargesum: 0.0000000
charge: 0.035449 -0.221640 -0.217996 -0.287436 -0.364323 -0.147747 0.284336 -0.118812 -0.055026 0.274899 -0.318456 -0.118519 -0.177448 0.050076 -0.179724 -0.146793 -0.218405 -0.188230 0.339177 0.254646 -0.212369 -0.227428 -0.113121 0.120821 0.118332 0.102714 0.106418 0.103342 0.105586 0.107893 0.116609 0.104627 0.154879 0.098023 0.097595 0.098938 0.166964 0.152072 0.153348 0.166729
qa: 0.0354 -0.2216 -0.2180 -0.2874 -0.3643 -0.1477 0.2843 -0.1188 -0.0550 0.2749 -0.3185 -0.1185 -0.1774 0.0501 -0.1797 -0.1468 -0.2184 -0.1882 0.3392 0.2546 -0.2124 -0.2274 -0.1131 0.1208 0.1183 0.1027 0.1064 0.1033 0.1056 0.1079 0.1166 0.1046 0.1549 0.0980 0.0976 0.0989 0.1670 0.1521 0.1533 0.1667
va: 2.7796 1.0611 1.0720 1.9461 1.9379 2.9433 3.8443 3.9069 3.9802 3.5722 3.9906 3.6492 3.7778 3.8964 3.5292 3.9327 3.9303 4.0300 3.7716 3.9281 3.9316 3.9267 3.8380 1.0122 1.0236 0.9980 0.9988 1.0025 1.0049 1.0024 0.9924 1.0099 1.0004 1.0028 1.0036 1.0024 0.9966 0.9995 0.9989 0.9850
dispcorr: -0.018785122 hartree
energy: -1461.205154587501
dipole: 5.84344 -6.57637 -0.73292 6.56266 -5.74597 0.81669 8.52305 -9.16482 -0.64176
magnitude: 1.27123 au
magnitude: 3.23120 debye
