program: Orca
programVersion: 5.0.2
elementType: S F F O O N C C C C C C C C C C C C C C C C C H H H H H H H H H H H H H H H H H
charge: 0
multiplicity: 1
keywords: wb97x-d3
keywords: def2-TZVPP
keywords: def2/J RIJCOSX
keywords: DEFGRID2
keywords: scfconv7
keywords: smallprint printgap noloewdin
keywords: NOSOSCF
formula: C17H17F2NO2S
InChI: InChI=1/C17H17F2NO2S/c1-11-6-7-23-16(11)15-8-17(2,22-20-15)10-21-9-12-13(18)4-3-5-14(12)19/h3-7H,8-10H2,1-2H3
40 atoms
S  2.670253 -0.36223 -0.536418
F  -0.419424 -2.014687 0.789472
F  -3.549934 -0.449032 -2.320207
O  -0.444155 2.795359 1.479504
O  -2.040816 0.576188 0.929741
N  0.593202 1.979798 1.847273
C  -0.86053 2.51309 0.117066
C  0.27933 1.652576 -0.426394
C  -2.179435 1.757635 0.169933
C  1.003623 1.31287 0.836745
C  -1.040349 3.826506 -0.615282
C  2.079862 0.353342 0.921716
C  2.747338 -0.131744 2.02529
C  -2.756471 -0.538933 0.438463
C  -2.031227 -1.208438 -0.699869
C  3.734576 -1.083891 1.656738
C  2.491476 0.264253 3.441648
C  3.805816 -1.304768 0.314915
C  -0.855252 -1.914729 -0.473887
C  -2.426043 -1.121316 -2.027255
C  -0.116651 -2.513427 -1.472263
C  -1.72374 -1.693711 -3.07078
C  -0.563983 -2.393943 -2.780034
H  0.933571 2.213173 -1.101139
H  -0.071884 0.775398 -0.972322
H  -2.48316 1.550486 -0.861587
H  -2.957067 2.395304 0.608974
H  -1.338575 3.639766 -1.647187
H  -1.811707 4.442174 -0.150842
H  -0.109415 4.393133 -0.633823
H  -3.770787 -0.261414 0.140381
H  -2.858245 -1.235041 1.27189
H  4.367384 -1.585666 2.375572
H  1.437814 0.171363 3.704857
H  3.066476 -0.36356 4.120722
H  2.77315 1.301371 3.627796
H  4.468312 -1.973724 -0.213117
H  0.789519 -3.05273 -1.233653
H  -2.079509 -1.593658 -4.087161
H  0.001159 -2.849181 -3.581531
elementType: S F O N C H
totalener: -1461.18413667 hartree
nucrepener: 2219.75992395 hartree
electener: -3680.94406061 hartree
oneelecener: -6418.27393523 hartree
twoeener: 2737.32987462 hartree
cpcmener: -0.03551031 hartree
kineticenergy: 1456.14653173 hartree
xcener: -118.607937231469 hartree
chargesum: -0.0000000
charge: 0.034951 -0.217690 -0.221876 -0.292693 -0.380662 -0.143643 0.326996 -0.117565 -0.098490 0.237092 -0.309903 -0.081697 -0.182981 0.044600 -0.167799 -0.141496 -0.220808 -0.190187 0.262191 0.360479 -0.236778 -0.231179 -0.099342 0.128253 0.099088 0.101149 0.111587 0.104497 0.105191 0.102996 0.110367 0.115612 0.155656 0.096223 0.098971 0.100760 0.165540 0.152869 0.152290 0.167428
qa: 0.0350 -0.2177 -0.2219 -0.2927 -0.3807 -0.1436 0.3270 -0.1176 -0.0985 0.2371 -0.3099 -0.0817 -0.1830 0.0446 -0.1678 -0.1415 -0.2208 -0.1902 0.2622 0.3605 -0.2368 -0.2312 -0.0993 0.1283 0.0991 0.1011 0.1116 0.1045 0.1052 0.1030 0.1104 0.1156 0.1557 0.0962 0.0990 0.1008 0.1655 0.1529 0.1523 0.1674
va: 2.7645 1.0678 1.0648 1.9436 1.9398 2.9397 3.7923 3.9172 4.0473 3.5930 3.9632 3.5961 3.7924 3.8995 3.5526 3.9104 3.9273 4.0181 3.8177 3.7541 3.9030 3.9465 3.8391 1.0115 1.0184 0.9921 1.0068 1.0002 1.0071 1.0062 1.0036 0.9959 0.9998 1.0057 1.0020 1.0011 0.9968 1.0014 0.9993 0.9841
dispcorr: -0.023316324 hartree
energy: -1461.207452990072
dipole: 3.97767 -3.76271 0.21496 9.63781 -10.78274 -1.14493 2.77193 -5.34095 -2.56902
magnitude: 2.82081 au
magnitude: 7.16992 debye
