program: Orca
programVersion: 5.0.2
elementType: S F F O O N C C C C C C C C C C C C C C C C C H H H H H H H H H H H H H H H H H
charge: 0
multiplicity: 1
keywords: wb97x-d3
keywords: def2-TZVPP
keywords: def2/J RIJCOSX
keywords: DEFGRID2
keywords: scfconv7
keywords: smallprint printgap noloewdin
keywords: NOSOSCF
formula: C17H17F2NO2S
InChI: InChI=1/C17H17F2NO2S/c1-11-6-7-23-16(11)15-8-17(2,22-20-15)10-21-9-12-13(18)4-3-5-14(12)19/h3-7H,8-10H2,1-2H3
40 atoms
S  3.117408 1.058284 -0.795569
F  -3.36411 -1.43031 1.089073
F  -0.577055 -0.624949 -2.584537
O  -1.222631 1.00066 1.399664
O  -2.290482 1.36714 -1.433092
N  -0.023391 0.349395 1.465791
C  -1.111399 2.195562 0.582949
C  0.233186 2.022127 -0.122472
C  -2.310285 2.270104 -0.353818
C  0.803667 0.871273 0.643349
C  -1.12059 3.396164 1.514377
C  2.146349 0.369459 0.458399
C  2.823378 -0.626326 1.127429
C  -2.933678 0.123601 -1.259499
C  -2.021217 -0.972563 -0.776267
C  4.130809 -0.80777 0.601254
C  2.291552 -1.426803 2.26948
C  4.425768 0.028608 -0.43176
C  -2.272136 -1.720245 0.364083
C  -0.866564 -1.311672 -1.468298
C  -1.458693 -2.747941 0.797163
C  -0.007858 -2.319563 -1.078806
C  -0.320035 -3.04245 0.062986
H  0.853713 2.916781 -0.043481
H  0.145484 1.77934 -1.18431
H  -2.3186 3.272186 -0.790339
H  -3.233331 2.168926 0.230914
H  -0.303392 3.334578 2.234237
H  -0.99607 4.319444 0.948257
H  -2.059162 3.462887 2.067025
H  -3.333103 -0.157068 -2.237085
H  -3.793003 0.222829 -0.592262
H  4.825952 -1.53938 0.989572
H  1.920143 -0.790526 3.072856
H  1.461657 -2.064735 1.962906
H  3.070815 -2.067926 2.678434
H  5.343794 0.088212 -0.996475
H  -1.707485 -3.300977 1.693137
H  0.878673 -2.537856 -1.659002
H  0.331885 -3.843303 0.384118
elementType: S F O N C H
totalener: -1461.18236550 hartree
nucrepener: 2256.45876901 hartree
electener: -3717.64113451 hartree
oneelecener: -6492.31662847 hartree
twoeener: 2774.67549396 hartree
cpcmener: -0.02952797 hartree
kineticenergy: 1456.15083911 hartree
xcener: -118.611737363225 hartree
chargesum: -0.0000000
charge: 0.036140 -0.224705 -0.221711 -0.285539 -0.382964 -0.115759 0.296753 -0.155534 -0.009729 0.268592 -0.335395 -0.135634 -0.202355 0.030892 -0.150271 -0.134097 -0.228223 -0.193954 0.342172 0.327891 -0.222367 -0.263059 -0.135753 0.128037 0.118897 0.111960 0.099880 0.110076 0.099047 0.106990 0.122395 0.104760 0.154281 0.098636 0.101691 0.102212 0.166566 0.148853 0.148315 0.172012
qa: 0.0361 -0.2247 -0.2217 -0.2855 -0.3830 -0.1158 0.2968 -0.1555 -0.0097 0.2686 -0.3354 -0.1356 -0.2024 0.0309 -0.1503 -0.1341 -0.2282 -0.1940 0.3422 0.3279 -0.2224 -0.2631 -0.1358 0.1280 0.1189 0.1120 0.0999 0.1101 0.0990 0.1070 0.1224 0.1048 0.1543 0.0986 0.1017 0.1022 0.1666 0.1489 0.1483 0.1720
va: 2.7786 1.0607 1.0673 1.9513 1.9386 2.8993 3.7817 3.9394 3.9296 3.5029 3.9971 3.6070 3.7470 3.9242 3.5316 3.9229 3.9310 4.0384 3.7825 3.7814 3.9093 3.8879 3.7882 1.0114 1.0322 0.9981 1.0092 0.9990 1.0052 1.0049 0.9907 1.0110 1.0004 1.0041 1.0027 1.0034 0.9971 0.9997 1.0019 0.9815
dispcorr: -0.025250702 hartree
energy: -1461.207616200920
dipole: 4.57822 -3.60669 0.97153 6.90949 -6.60147 0.30802 9.21077 -9.30187 -0.09110
magnitude: 1.02325 au
magnitude: 2.60090 debye
