program: Orca
programVersion: 5.0.2
elementType: S F F O O N C C C C C C C C C C C C C C C C C H H H H H H H H H H H H H H H H H
charge: 0
multiplicity: 1
keywords: wb97x-d3
keywords: def2-TZVPP
keywords: def2/J RIJCOSX
keywords: DEFGRID2
keywords: scfconv7
keywords: smallprint printgap noloewdin
keywords: NOSOSCF
formula: C17H17F2NO2S
InChI: InChI=1/C17H17F2NO2S/c1-11-6-7-23-16(11)15-8-17(2,22-20-15)10-21-9-12-13(18)4-3-5-14(12)19/h3-7H,8-10H2,1-2H3
40 atoms
S  3.566672 -0.095097 -0.173489
F  -0.744625 -2.29968 -0.498318
F  -5.150758 -0.968887 -1.329632
O  0.097238 2.872962 1.523257
O  -1.968942 0.430404 -0.145745
N  1.354211 2.444768 1.863703
C  -0.404093 2.140354 0.377028
C  0.810512 1.348546 -0.110748
C  -1.495106 1.22201 0.917694
C  1.779187 1.604781 0.999073
C  -0.925684 3.137897 -0.636939
C  3.082313 0.988224 1.08319
C  4.064544 1.118218 2.040883
C  -2.819596 -0.614993 0.276931
C  -2.945124 -1.593651 -0.850782
C  5.202576 0.329079 1.725782
C  3.978249 1.964886 3.267224
C  5.075927 -0.373004 0.565885
C  -1.873552 -2.400239 -1.214251
C  -4.08861 -1.731478 -1.623091
C  -1.914929 -3.300914 -2.256948
C  -4.190693 -2.619697 -2.677099
C  -3.090626 -3.403393 -2.987312
H  1.202344 1.719735 -1.061938
H  0.600091 0.285346 -0.240574
H  -2.303289 1.820236 1.359265
H  -1.079135 0.588477 1.713745
H  -1.279941 2.628333 -1.532245
H  -1.754392 3.720711 -0.232088
H  -0.13451 3.824299 -0.940205
H  -3.798311 -0.228331 0.575214
H  -2.402906 -1.117232 1.157672
H  6.084826 0.29097 2.349633
H  3.878436 3.022973 3.022727
H  3.116037 1.700809 3.88016
H  4.873599 1.844212 3.874586
H  5.794161 -1.039688 0.113164
H  -1.05107 -3.907697 -2.492577
H  -5.109794 -2.693206 -3.242481
H  -3.148391 -4.103273 -3.809473
elementType: S F O N C H
totalener: -1461.18498294 hartree
nucrepener: 2048.21846623 hartree
electener: -3509.40344917 hartree
oneelecener: -6074.76646063 hartree
twoeener: 2565.36301146 hartree
cpcmener: -0.02805632 hartree
kineticenergy: 1456.14568785 hartree
xcener: -118.602310937272 hartree
chargesum: 0.0000000
charge: 0.036336 -0.218545 -0.218541 -0.287452 -0.379731 -0.156823 0.302833 -0.114165 -0.084339 0.272425 -0.311920 -0.117863 -0.172034 0.084437 -0.192712 -0.148990 -0.217107 -0.185641 0.300648 0.316640 -0.225189 -0.229373 -0.103297 0.119002 0.107366 0.110606 0.115235 0.097023 0.103805 0.105202 0.096241 0.105187 0.155446 0.099069 0.098098 0.099049 0.167489 0.153489 0.151675 0.166421
qa: 0.0363 -0.2185 -0.2185 -0.2875 -0.3797 -0.1568 0.3028 -0.1142 -0.0843 0.2724 -0.3119 -0.1179 -0.1720 0.0844 -0.1927 -0.1490 -0.2171 -0.1856 0.3006 0.3166 -0.2252 -0.2294 -0.1033 0.1190 0.1074 0.1106 0.1152 0.0970 0.1038 0.1052 0.0962 0.1052 0.1554 0.0991 0.0981 0.0990 0.1675 0.1535 0.1517 0.1664
va: 2.7805 1.0722 1.0727 1.9464 1.9219 2.9369 3.8509 3.9076 4.0440 3.5893 3.9548 3.6703 3.7765 3.8705 3.6335 3.9331 3.9290 4.0297 3.8653 3.8549 3.9463 3.9328 3.8344 1.0091 1.0255 0.9995 0.9956 1.0132 1.0060 1.0050 1.0068 0.9930 1.0001 1.0026 1.0037 1.0024 0.9963 0.9998 0.9999 0.9849
dispcorr: -0.018371806 hartree
energy: -1461.203354743470
dipole: 8.70155 -8.53692 0.16462 10.76015 -12.46723 -1.70708 5.98236 -6.99793 -1.01557
magnitude: 1.99314 au
magnitude: 5.06615 debye
