program: Orca
programVersion: 5.0.2
elementType: S F F O O N C C C C C C C C C C C C C C C C C H H H H H H H H H H H H H H H H H
charge: 0
multiplicity: 1
keywords: wb97x-d3
keywords: def2-TZVPP
keywords: def2/J RIJCOSX
keywords: DEFGRID2
keywords: scfconv7
keywords: smallprint printgap noloewdin
keywords: NOSOSCF
formula: C17H17F2NO2S
InChI: InChI=1/C17H17F2NO2S/c1-11-6-7-23-16(11)15-8-17(2,22-20-15)10-21-9-12-13(18)4-3-5-14(12)19/h3-7H,8-10H2,1-2H3
40 atoms
S  2.756725 -0.048504 -0.611077
F  -0.715939 -1.86549 1.17421
F  -2.89339 -0.457873 -2.720672
O  -0.579453 2.74555 1.559927
O  -2.231212 0.705954 0.783826
N  0.409052 1.853168 1.888442
C  -0.918327 2.634779 0.152228
C  0.239267 1.821217 -0.422136
C  -2.254066 1.911034 0.048126
C  0.868419 1.303604 0.830171
C  -1.035042 4.024252 -0.438507
C  1.900864 0.293927 0.851643
C  2.318496 -0.518853 1.881108
C  -2.837398 -0.404454 0.153964
C  -1.856657 -1.131234 -0.726158
C  3.331949 -1.418355 1.453349
C  1.781545 -0.500427 3.273685
C  3.665908 -1.278289 0.140832
C  -0.788462 -1.820434 -0.164131
C  -1.890306 -1.109648 -2.112008
C  0.187784 -2.45459 -0.900838
C  -0.940433 -1.727172 -2.904305
C  0.10163 -2.398235 -2.28468
H  0.946813 2.447044 -0.97532
H  -0.083966 1.025498 -1.095077
H  -2.462205 1.741284 -1.013509
H  -3.05272 2.557489 0.432687
H  -1.814718 4.606415 0.054008
H  -0.092321 4.564405 -0.355505
H  -1.288713 3.956742 -1.49691
H  -3.722909 -0.108417 -0.412634
H  -3.186275 -1.068137 0.946334
H  3.788975 -2.147795 2.107738
H  0.692349 -0.467848 3.287676
H  2.102781 -1.387515 3.817263
H  2.130917 0.371041 3.828676
H  4.403256 -1.833489 -0.418741
H  0.99898 -2.972831 -0.407158
H  -1.016307 -1.680337 -3.982259
H  0.857437 -2.883328 -2.886848
elementType: S F O N C H
totalener: -1461.18328523 hartree
nucrepener: 2256.09316344 hartree
electener: -3717.27644868 hartree
oneelecener: -6490.88309534 hartree
twoeener: 2773.60664666 hartree
cpcmener: -0.03584531 hartree
kineticenergy: 1456.15336334 hartree
xcener: -118.609581940507 hartree
chargesum: 0.0000000
charge: 0.032628 -0.219354 -0.222244 -0.293428 -0.385027 -0.129940 0.322912 -0.130828 -0.083765 0.197938 -0.305812 -0.024715 -0.201682 0.052622 -0.206664 -0.147155 -0.229644 -0.182713 0.296520 0.373507 -0.249494 -0.223965 -0.104203 0.128859 0.102263 0.098702 0.109792 0.103837 0.102175 0.105220 0.108243 0.114299 0.155115 0.092062 0.101231 0.105634 0.163926 0.154995 0.151980 0.166173
qa: 0.0326 -0.2194 -0.2222 -0.2934 -0.3850 -0.1299 0.3229 -0.1308 -0.0838 0.1979 -0.3058 -0.0247 -0.2017 0.0526 -0.2067 -0.1472 -0.2296 -0.1827 0.2965 0.3735 -0.2495 -0.2240 -0.1042 0.1289 0.1023 0.0987 0.1098 0.1038 0.1022 0.1052 0.1082 0.1143 0.1551 0.0921 0.1012 0.1056 0.1639 0.1550 0.1520 0.1662
va: 2.7496 1.0672 1.0655 1.9473 1.9416 2.9390 3.8103 3.9271 4.0288 3.6437 3.9569 3.5948 3.7804 3.8993 3.5955 3.9055 3.9331 4.0111 3.7854 3.7466 3.8953 3.9478 3.8288 1.0091 1.0219 0.9954 1.0044 1.0078 1.0066 1.0004 1.0045 0.9977 1.0002 1.0110 1.0007 0.9995 0.9965 0.9973 0.9987 0.9852
dispcorr: -0.025273011 hartree
energy: -1461.208558244631
dipole: 2.38008 -1.94867 0.43141 8.14588 -9.20538 -1.05950 2.73746 -5.32674 -2.58928
magnitude: 2.83073 au
magnitude: 7.19514 debye
