program: Orca
programVersion: 5.0.2
elementType: S F F O O N C C C C C C C C C C C C C C C C C H H H H H H H H H H H H H H H H H
charge: 0
multiplicity: 1
keywords: wb97x-d3
keywords: def2-TZVPP
keywords: def2/J RIJCOSX
keywords: DEFGRID2
keywords: scfconv7
keywords: smallprint printgap noloewdin
keywords: NOSOSCF
formula: C17H17F2NO2S
InChI: InChI=1/C17H17F2NO2S/c1-11-6-7-23-16(11)15-8-17(2,22-20-15)10-21-9-12-13(18)4-3-5-14(12)19/h3-7H,8-10H2,1-2H3
40 atoms
S  3.704862 0.997003 -0.875033
F  -4.768679 -1.466578 0.458197
F  -1.334134 -1.124369 -2.701937
O  -0.108155 1.529365 2.125578
O  -2.081458 0.990979 -0.837732
N  1.228183 1.2602 2.175077
C  -0.535425 1.784048 0.763913
C  0.702522 1.459387 -0.078385
C  -1.692497 0.828934 0.503861
C  1.718562 1.223102 0.99719
C  -0.947684 3.24081 0.661019
C  3.117919 0.960182 0.750886
C  4.127484 0.672853 1.643456
C  -3.239539 0.279216 -1.19772
C  -3.065316 -1.216863 -1.132148
C  5.369189 0.488015 0.979371
C  3.969034 0.561421 3.123626
C  5.292636 0.633018 -0.371911
C  -3.82837 -2.034045 -0.310723
C  -2.104919 -1.868299 -1.896399
C  -3.680092 -3.406468 -0.24797
C  -1.910709 -3.233964 -1.875372
C  -2.712189 -4.00045 -1.041234
H  0.983007 2.282928 -0.73902
H  0.582072 0.569932 -0.702902
H  -2.524872 1.05189 1.186331
H  -1.365653 -0.199903 0.706866
H  -1.30053 3.475607 -0.342738
H  -1.749818 3.473289 1.363215
H  -0.103942 3.89849 0.876099
H  -3.475574 0.577743 -2.220711
H  -4.087667 0.584322 -0.57713
H  6.288259 0.255139 1.499833
H  3.240822 -0.203906 3.39558
H  4.918463 0.303476 3.591085
H  3.619331 1.495851 3.564625
H  6.089653 0.543489 -1.094797
H  -4.308257 -3.993316 0.408978
H  -1.152902 -3.688453 -2.499509
H  -2.580367 -5.073571 -1.010944
elementType: S F O N C H
totalener: -1461.19413837 hartree
nucrepener: 2060.40698759 hartree
electener: -3521.60112596 hartree
oneelecener: -6098.90931292 hartree
twoeener: 2577.30818696 hartree
cpcmener: -0.02347794 hartree
kineticenergy: 1456.14142316 hartree
xcener: -118.602682657964 hartree
chargesum: -0.0000000
charge: 0.036987 -0.219766 -0.215552 -0.269973 -0.358965 -0.145203 0.286953 -0.140677 -0.047471 0.281039 -0.322843 -0.119874 -0.174868 0.047489 -0.197069 -0.145571 -0.212871 -0.186217 0.350815 0.273578 -0.226772 -0.226943 -0.102340 0.114628 0.115885 0.107886 0.103583 0.094751 0.100192 0.108317 0.118731 0.102919 0.151254 0.097994 0.096563 0.098367 0.161930 0.148802 0.150551 0.163760
qa: 0.0370 -0.2198 -0.2156 -0.2700 -0.3590 -0.1452 0.2870 -0.1407 -0.0475 0.2810 -0.3228 -0.1199 -0.1749 0.0475 -0.1971 -0.1456 -0.2129 -0.1862 0.3508 0.2736 -0.2268 -0.2269 -0.1023 0.1146 0.1159 0.1079 0.1036 0.0948 0.1002 0.1083 0.1187 0.1029 0.1513 0.0980 0.0966 0.0984 0.1619 0.1488 0.1506 0.1638
va: 2.7776 1.0670 1.0742 1.9712 1.9454 2.9416 3.8661 3.9332 3.9858 3.5698 3.9864 3.6691 3.7900 3.9107 3.5241 3.9362 3.9305 4.0316 3.7934 3.9014 3.9437 3.9403 3.8317 1.0068 1.0221 1.0001 0.9970 1.0161 1.0076 1.0004 0.9898 1.0126 1.0014 1.0040 1.0025 1.0041 0.9985 1.0010 1.0004 0.9860
dispcorr: -0.018955834 hartree
energy: -1461.213094207007
dipole: 8.60940 -8.50389 0.10551 7.33259 -8.35152 -1.01893 8.95166 -9.97373 -1.02207
magnitude: 1.44706 au
magnitude: 3.67813 debye
