program: Orca
programVersion: 5.0.2
elementType: S F F O O N C C C C C C C C C C C C C C C C C H H H H H H H H H H H H H H H H H
charge: 0
multiplicity: 1
keywords: wb97x-d3
keywords: def2-TZVPP
keywords: def2/J RIJCOSX
keywords: DEFGRID2
keywords: scfconv7
keywords: smallprint printgap noloewdin
keywords: NOSOSCF
formula: C17H17F2NO2S
InChI: InChI=1/C17H17F2NO2S/c1-11-6-7-23-16(11)15-8-17(2,22-20-15)10-21-9-12-13(18)4-3-5-14(12)19/h3-7H,8-10H2,1-2H3
40 atoms
S  3.169293 1.247651 -0.753789
F  -0.178936 -0.861967 -2.28299
F  -3.725886 -1.201297 0.748482
O  -1.190493 0.941329 1.356091
O  -2.008194 1.354899 -1.536038
N  -0.001449 0.280801 1.359917
C  -1.097661 2.177765 0.602927
C  0.305661 2.127694 -0.006107
C  -2.212813 2.206574 -0.436004
C  0.848688 0.883062 0.624808
C  -1.273515 3.326585 1.580498
C  2.193246 0.391006 0.394285
C  2.876249 -0.679227 0.927113
C  -2.698677 0.127271 -1.552639
C  -2.002795 -0.993948 -0.826369
C  4.187101 -0.782839 0.383496
C  2.385556 -1.637812 1.963328
C  4.480744 0.182618 -0.527365
C  -0.764367 -1.466434 -1.238165
C  -2.544514 -1.631421 0.279226
C  -0.108993 -2.522739 -0.639142
C  -1.934684 -2.688608 0.924942
C  -0.710965 -3.134071 0.450113
H  0.899491 3.006078 0.256383
H  0.301241 2.050375 -1.095927
H  -2.265779 3.225855 -0.830491
H  -3.173366 2.006769 0.055994
H  -1.175216 4.284971 1.069774
H  -2.255273 3.298071 2.056812
H  -0.514906 3.286694 2.363294
H  -2.802503 -0.146305 -2.605253
H  -3.714337 0.24929 -1.167573
H  4.884144 -1.558472 0.671264
H  2.939973 -1.505629 2.895427
H  1.330133 -1.517207 2.18423
H  2.553256 -2.66711 1.642236
H  5.39931 0.318262 -1.078555
H  0.850363 -2.854997 -1.012815
H  -2.406996 -3.150399 1.781874
H  -0.218118 -3.963592 0.938956
elementType: S F O N C H
totalener: -1461.18944759 hartree
nucrepener: 2253.24869613 hartree
electener: -3714.43814372 hartree
oneelecener: -6485.87858665 hartree
twoeener: 2771.44044294 hartree
cpcmener: -0.02404805 hartree
kineticenergy: 1456.15726918 hartree
xcener: -118.612160066370 hartree
chargesum: 0.0000000
charge: 0.032664 -0.221981 -0.223636 -0.265664 -0.366788 -0.114709 0.282533 -0.147418 -0.013736 0.244927 -0.328209 -0.071358 -0.218923 0.018029 -0.177958 -0.126050 -0.285150 -0.191098 0.341144 0.353065 -0.247995 -0.220438 -0.127579 0.122673 0.116385 0.111084 0.096393 0.097838 0.105681 0.107934 0.117365 0.104127 0.151313 0.119642 0.103693 0.108505 0.162043 0.146292 0.144807 0.160551
qa: 0.0327 -0.2220 -0.2236 -0.2657 -0.3668 -0.1147 0.2825 -0.1474 -0.0137 0.2449 -0.3282 -0.0714 -0.2189 0.0180 -0.1780 -0.1260 -0.2851 -0.1911 0.3411 0.3531 -0.2480 -0.2204 -0.1276 0.1227 0.1164 0.1111 0.0964 0.0978 0.1057 0.1079 0.1174 0.1041 0.1513 0.1196 0.1037 0.1085 0.1620 0.1463 0.1448 0.1606
va: 2.7691 1.0655 1.0613 1.9713 1.9480 2.9267 3.8238 3.9302 3.9301 3.5427 3.9938 3.5720 3.7521 3.9290 3.5480 3.9250 3.9291 4.0421 3.7762 3.7693 3.9028 3.9446 3.8004 1.0115 1.0321 0.9991 1.0101 1.0048 1.0051 1.0011 0.9927 1.0094 0.9983 0.9963 1.0242 0.9926 0.9984 1.0013 1.0011 0.9876
dispcorr: -0.025095292 hartree
energy: -1461.214542878362
dipole: 4.07024 -3.34315 0.72710 6.15238 -5.84734 0.30504 8.82374 -8.78342 0.04032
magnitude: 0.78952 au
magnitude: 2.00681 debye
