program: Orca
programVersion: 5.0.2
elementType: S F F O O N C C C C C C C C C C C C C C C C C H H H H H H H H H H H H H H H H H
charge: 0
multiplicity: 1
keywords: wb97x-d3
keywords: def2-TZVPP
keywords: def2/J RIJCOSX
keywords: DEFGRID2
keywords: scfconv7
keywords: smallprint printgap noloewdin
keywords: NOSOSCF
formula: C17H17F2NO2S
InChI: InChI=1/C17H17F2NO2S/c1-11-6-7-23-16(11)15-8-17(2,22-20-15)10-21-9-12-13(18)4-3-5-14(12)19/h3-7H,8-10H2,1-2H3
40 atoms
S  3.649992 0.934107 -1.082942
F  -1.823016 -1.271607 -2.924001
F  -4.357412 -1.304875 1.010284
O  0.007562 1.573305 2.097903
O  -2.058551 0.967596 -0.792834
N  1.332307 1.246919 2.08386
C  -0.482608 1.822885 0.755479
C  0.734628 1.562858 -0.1382
C  -1.601027 0.813246 0.528945
C  1.776438 1.23987 0.887414
C  -0.972871 3.256518 0.688438
C  3.15483 0.941875 0.573133
C  4.205754 0.648632 1.414268
C  -3.255578 0.283656 -1.0796
C  -3.117946 -1.213188 -0.97653
C  5.403585 0.421419 0.685686
C  4.128509 0.573558 2.903214
C  5.254119 0.54164 -0.661993
C  -2.38351 -1.939517 -1.906201
C  -3.661207 -1.952543 0.065163
C  -2.214528 -3.307375 -1.844815
C  -3.517851 -3.321532 0.184505
C  -2.790668 -3.993531 -0.785127
H  1.009681 2.436857 -0.733833
H  0.589262 0.731416 -0.83297
H  -2.410173 0.990498 1.251115
H  -1.215885 -0.200811 0.703909
H  -1.786431 3.429181 1.395955
H  -0.164352 3.95239 0.919602
H  -1.339048 3.495485 -0.31027
H  -3.529918 0.563499 -2.097551
H  -4.064185 0.631451 -0.429086
H  6.345444 0.17812 1.158228
H  3.44717 -0.212088 3.233107
H  5.110533 0.364755 3.325924
H  3.76499 1.505674 3.337451
H  6.006986 0.418649 -1.425927
H  -1.643934 -3.823679 -2.605465
H  -3.963695 -3.846932 1.018746
H  -2.668473 -5.06582 -0.713881
elementType: S F O N C H
totalener: -1461.19442493 hartree
nucrepener: 2058.57004043 hartree
electener: -3519.76446537 hartree
oneelecener: -6095.25300990 hartree
twoeener: 2575.48854453 hartree
cpcmener: -0.02339503 hartree
kineticenergy: 1456.13531354 hartree
xcener: -118.601251290081 hartree
chargesum: 0.0000000
charge: 0.036962 -0.216643 -0.217976 -0.269423 -0.362770 -0.147174 0.284677 -0.132559 -0.050323 0.282303 -0.321293 -0.119711 -0.176991 0.052507 -0.219370 -0.144690 -0.213474 -0.186471 0.286898 0.357541 -0.233176 -0.222847 -0.098925 0.115249 0.114780 0.107971 0.103419 0.100703 0.107550 0.094934 0.113346 0.104887 0.151300 0.098992 0.096910 0.097098 0.161745 0.150271 0.149900 0.163875
qa: 0.0370 -0.2166 -0.2180 -0.2694 -0.3628 -0.1472 0.2847 -0.1326 -0.0503 0.2823 -0.3213 -0.1197 -0.1770 0.0525 -0.2194 -0.1447 -0.2135 -0.1865 0.2869 0.3575 -0.2332 -0.2228 -0.0989 0.1152 0.1148 0.1080 0.1034 0.1007 0.1076 0.0949 0.1133 0.1049 0.1513 0.0990 0.0969 0.0971 0.1617 0.1503 0.1499 0.1639
va: 2.7782 1.0745 1.0686 1.9715 1.9428 2.9457 3.8906 3.9227 3.9906 3.5633 3.9791 3.6659 3.7909 3.9059 3.5343 3.9355 3.9313 4.0320 3.8940 3.7740 3.9394 3.9492 3.8315 1.0082 1.0208 1.0014 0.9978 1.0070 1.0021 1.0150 0.9923 1.0086 1.0014 1.0033 1.0024 1.0046 0.9986 1.0004 1.0008 0.9858
dispcorr: -0.018895360 hartree
energy: -1461.213320294300
dipole: 8.99984 -8.94034 0.05950 7.55956 -8.54260 -0.98304 8.51088 -9.48488 -0.97400
magnitude: 1.38513 au
magnitude: 3.52072 debye
