program: Orca
programVersion: 5.0.2
elementType: S F F O O N C C C C C C C C C C C C C C C C C H H H H H H H H H H H H H H H H H
charge: 0
multiplicity: 1
keywords: wb97x-d3
keywords: def2-TZVPP
keywords: def2/J RIJCOSX
keywords: DEFGRID2
keywords: scfconv7
keywords: smallprint printgap noloewdin
keywords: NOSOSCF
formula: C17H17F2NO2S
InChI: InChI=1/C17H17F2NO2S/c1-11-6-7-23-16(11)15-8-17(2,22-20-15)10-21-9-12-13(18)4-3-5-14(12)19/h3-7H,8-10H2,1-2H3
40 atoms
S  3.603721 0.881031 -0.850932
F  -4.272144 -1.43893 0.756746
F  -1.566806 -1.146947 -3.052539
O  -0.17958 1.693647 2.117346
O  -2.055856 1.030865 -0.889033
N  1.121275 1.286067 2.178577
C  -0.589032 1.927874 0.745796
C  0.683256 1.676903 -0.068488
C  -1.674564 0.896827 0.4588
C  1.635896 1.265078 1.01088
C  -1.097124 3.352271 0.637215
C  3.010844 0.89093 0.77359
C  3.991744 0.525723 1.669289
C  -3.186163 0.272123 -1.251448
C  -2.950843 -1.214389 -1.167126
C  5.216696 0.242293 1.008649
C  3.821662 0.432266 3.149508
C  5.155237 0.390591 -0.343143
C  -3.490192 -2.013279 -0.168122
C  -2.125825 -1.869973 -2.073052
C  -3.262194 -3.372323 -0.070316
C  -1.860943 -3.223051 -2.025585
C  -2.440379 -3.971085 -1.011365
H  1.033139 2.57343 -0.58689
H  0.562639 0.895172 -0.822189
H  -2.528951 1.065102 1.128972
H  -1.282772 -0.108471 0.666592
H  -1.393788 3.580264 -0.386366
H  -1.962374 3.515809 1.281993
H  -0.318936 4.062211 0.921403
H  -3.42527 0.552998 -2.277908
H  -4.05063 0.550544 -0.640722
H  6.113474 -0.061219 1.531562
H  4.760443 0.150267 3.624492
H  3.497079 1.380112 3.580705
H  3.07044 -0.309756 3.424272
H  5.944323 0.238323 -1.064257
H  -3.715438 -3.9450 0.72786
H  -1.215657 -3.679881 -2.764051
H  -2.24727 -5.033671 -0.953859
elementType: S F O N C H
totalener: -1461.19461219 hartree
nucrepener: 2067.53112763 hartree
electener: -3528.72573982 hartree
oneelecener: -6113.17489775 hartree
twoeener: 2584.44915793 hartree
cpcmener: -0.02341647 hartree
kineticenergy: 1456.13910296 hartree
xcener: -118.601930942596 hartree
chargesum: -0.0000000
charge: 0.036443 -0.218025 -0.216781 -0.270136 -0.362465 -0.149277 0.290033 -0.124213 -0.063054 0.278854 -0.318463 -0.119486 -0.175407 0.051108 -0.217068 -0.145768 -0.213866 -0.185508 0.355566 0.283693 -0.220594 -0.230939 -0.101457 0.115903 0.111901 0.108172 0.105813 0.095705 0.101328 0.106258 0.113843 0.106238 0.151348 0.096626 0.097922 0.098946 0.162428 0.150041 0.150427 0.163909
qa: 0.0364 -0.2180 -0.2168 -0.2701 -0.3625 -0.1493 0.2900 -0.1242 -0.0631 0.2789 -0.3185 -0.1195 -0.1754 0.0511 -0.2171 -0.1458 -0.2139 -0.1855 0.3556 0.2837 -0.2206 -0.2309 -0.1015 0.1159 0.1119 0.1082 0.1058 0.0957 0.1013 0.1063 0.1138 0.1062 0.1513 0.0966 0.0979 0.0989 0.1624 0.1500 0.1504 0.1639
va: 2.7773 1.0682 1.0740 1.9699 1.9427 2.9477 3.8872 3.9131 4.0121 3.5675 3.9717 3.6668 3.7899 3.9032 3.5326 3.9364 3.9313 4.0316 3.7766 3.8964 3.9457 3.9376 3.8338 1.0087 1.0225 1.0014 0.9959 1.0141 1.0068 1.0035 0.9925 1.0086 1.0015 1.0024 1.0041 1.0034 0.9982 1.0007 1.0003 0.9859
dispcorr: -0.018962251 hartree
energy: -1461.213574444851
dipole: 8.04907 -7.85552 0.19355 7.48112 -8.50465 -1.02353 9.03144 -10.02135 -0.98991
magnitude: 1.43702 au
magnitude: 3.65260 debye
