program: Orca
programVersion: 5.0.2
elementType: S F F O O N C C C C C C C C C C C C C C C C C H H H H H H H H H H H H H H H H H
charge: 0
multiplicity: 1
keywords: wb97x-d3
keywords: def2-TZVPP
keywords: def2/J RIJCOSX
keywords: DEFGRID2
keywords: scfconv7
keywords: smallprint printgap noloewdin
keywords: NOSOSCF
formula: C17H17F2NO2S
InChI: InChI=1/C17H17F2NO2S/c1-11-6-7-23-16(11)15-8-17(2,22-20-15)10-21-9-12-13(18)4-3-5-14(12)19/h3-7H,8-10H2,1-2H3
40 atoms
S  3.474837 2.978073 -0.0299
F  -3.98106 0.906464 -0.548538
F  -2.736325 -3.336425 -2.083841
O  1.021032 -1.013907 1.317602
O  -1.250603 0.083207 -1.259227
N  2.291693 -0.51808 1.33827
C  0.108548 -0.085276 0.678185
C  0.989769 1.11697 0.324708
C  -0.422595 -0.809149 -0.553599
C  2.324771 0.642698 0.808752
C  -0.993802 0.254861 1.663019
C  3.542131 1.413786 0.702439
C  4.821043 1.103285 1.108975
C  -2.179957 -0.528408 -2.12308
C  -3.30144 -1.18073 -1.357451
C  5.728144 2.155666 0.813424
C  5.233269 -0.165421 1.778777
C  5.144934 3.224018 0.203839
C  -4.150244 -0.422897 -0.558947
C  -3.524664 -2.549454 -1.336689
C  -5.154792 -0.963416 0.21551
C  -4.517492 -3.147343 -0.583284
C  -5.329225 -2.340038 0.196863
H  0.679286 2.029336 0.840731
H  1.004046 1.340262 -0.744665
H  -0.969156 -1.70361 -0.228431
H  0.411953 -1.145304 -1.184492
H  -1.695194 0.965966 1.228436
H  -1.554142 -0.635036 1.955548
H  -0.579305 0.710635 2.563416
H  -1.693825 -1.251428 -2.784548
H  -2.573424 0.263255 -2.762939
H  6.782203 2.111057 1.050967
H  4.720996 -0.304023 2.73206
H  5.001723 -1.039613 1.169151
H  6.305231 -0.163889 1.971642
H  5.614592 4.140726 -0.11995
H  -5.785932 -0.323972 0.81825
H  -4.646257 -4.221211 -0.603244
H  -6.10888 -2.787224 0.798424
elementType: S F O N C H
totalener: -1461.19357140 hartree
nucrepener: 2041.46092686 hartree
electener: -3502.65449826 hartree
oneelecener: -6061.00750492 hartree
twoeener: 2558.35300666 hartree
cpcmener: -0.02337652 hartree
kineticenergy: 1456.14376493 hartree
xcener: -118.603157509876 hartree
chargesum: 0.0000000
charge: 0.036151 -0.215860 -0.219944 -0.269465 -0.363989 -0.149635 0.318058 -0.134577 -0.078584 0.299585 -0.345268 -0.129207 -0.179884 0.059426 -0.148988 -0.143399 -0.215113 -0.187437 0.233535 0.319226 -0.207925 -0.209090 -0.115529 0.115217 0.114203 0.105037 0.114946 0.094316 0.100315 0.113187 0.102394 0.118491 0.150898 0.099020 0.097796 0.096776 0.162003 0.149573 0.150006 0.163737
qa: 0.0362 -0.2159 -0.2199 -0.2695 -0.3640 -0.1496 0.3181 -0.1346 -0.0786 0.2996 -0.3453 -0.1292 -0.1799 0.0594 -0.1490 -0.1434 -0.2151 -0.1874 0.2335 0.3192 -0.2079 -0.2091 -0.1155 0.1152 0.1142 0.1050 0.1149 0.0943 0.1003 0.1132 0.1024 0.1185 0.1509 0.0990 0.0978 0.0968 0.1620 0.1496 0.1500 0.1637
va: 2.7780 1.0737 1.0647 1.9741 1.9489 2.9438 3.8168 3.9250 4.0289 3.5327 3.9792 3.6662 3.7928 3.9059 3.5364 3.9354 3.9317 4.0323 3.9081 3.8075 3.9299 3.9242 3.8523 1.0085 1.0222 0.9947 1.0010 1.0151 1.0069 1.0055 1.0092 0.9907 1.0017 1.0033 1.0042 1.0024 0.9986 1.0004 0.9998 0.9860
dispcorr: -0.019534409 hartree
energy: -1461.213105807754
dipole: 10.86934 -11.62833 -0.75899 0.35351 0.05095 0.40446 8.76498 -9.07725 -0.31227
magnitude: 0.91497 au
magnitude: 2.32566 debye
