program: Orca
programVersion: 5.0.2
elementType: S F F O O N C C C C C C C C C C C C C C C C C H H H H H H H H H H H H H H H H H
charge: 0
multiplicity: 1
keywords: wb97x-d3
keywords: def2-TZVPP
keywords: def2/J RIJCOSX
keywords: DEFGRID2
keywords: scfconv7
keywords: smallprint printgap noloewdin
keywords: NOSOSCF
formula: C17H17F2NO2S
InChI: InChI=1/C17H17F2NO2S/c1-11-6-7-23-16(11)15-8-17(2,22-20-15)10-21-9-12-13(18)4-3-5-14(12)19/h3-7H,8-10H2,1-2H3
40 atoms
S  3.417082 0.712335 -0.994382
F  -4.66228 -1.63786 0.370933
F  -1.037081 -0.912582 -2.511698
O  -0.160938 1.821636 2.126621
O  -2.151151 1.128834 -0.797797
N  1.115606 1.335964 2.138367
C  -0.62399 2.033055 0.76885
C  0.611355 1.74739 -0.090068
C  -1.730029 1.007577 0.538678
C  1.578631 1.277663 0.950431
C  -1.120838 3.460157 0.652201
C  2.916312 0.814473 0.657146
C  3.919592 0.415307 1.512553
C  -3.208358 0.278051 -1.166693
C  -2.863606 -1.187531 -1.069017
C  5.08666 0.032281 0.79838
C  3.827253 0.381022 3.002429
C  4.961255 0.143731 -0.552586
C  -3.589392 -2.085132 -0.297439
C  -1.772152 -1.727151 -1.741025
C  -3.27525 -3.426266 -0.187002
C  -1.404742 -3.054215 -1.659414
C  -2.170612 -3.903076 -0.873096
H  0.984653 2.639192 -0.601058
H  0.433468 0.989869 -0.856193
H  -2.562002 1.190002 1.233664
H  -1.340347 0.001833 0.748972
H  -1.455046 3.672343 -0.363466
H  -1.958693 3.646058 1.326876
H  -0.323933 4.166204 0.891752
H  -3.453853 0.532223 -2.199788
H  -4.100483 0.490707 -0.569498
H  5.989591 -0.313063 1.28325
H  3.583126 1.360875 3.415504
H  3.051632 -0.305474 3.344929
H  4.774264 0.060523 3.435623
H  5.698291 -0.08329 -1.308183
H  -3.88241 -4.078925 0.426414
H  -0.541059 -3.416019 -2.201395
H  -1.903507 -4.948262 -0.796657
elementType: S F O N C H
totalener: -1461.19380092 hartree
nucrepener: 2086.89686635 hartree
electener: -3548.09066727 hartree
oneelecener: -6151.90172433 hartree
twoeener: 2603.81105706 hartree
cpcmener: -0.02327205 hartree
kineticenergy: 1456.12533525 hartree
xcener: -118.600059245355 hartree
chargesum: 0.0000000
charge: 0.035792 -0.219645 -0.214741 -0.272165 -0.359004 -0.150706 0.307600 -0.126546 -0.086649 0.275993 -0.316386 -0.115650 -0.174621 0.051929 -0.187746 -0.145105 -0.214964 -0.185212 0.343654 0.266437 -0.224572 -0.219451 -0.107820 0.117336 0.109500 0.109439 0.109077 0.096475 0.101538 0.104938 0.118319 0.101787 0.151180 0.098302 0.099212 0.096502 0.162557 0.148691 0.150854 0.163871
qa: 0.0358 -0.2196 -0.2147 -0.2722 -0.3590 -0.1507 0.3076 -0.1265 -0.0866 0.2760 -0.3164 -0.1157 -0.1746 0.0519 -0.1877 -0.1451 -0.2150 -0.1852 0.3437 0.2664 -0.2246 -0.2195 -0.1078 0.1173 0.1095 0.1094 0.1091 0.0965 0.1015 0.1049 0.1183 0.1018 0.1512 0.0983 0.0992 0.0965 0.1626 0.1487 0.1509 0.1639
va: 2.7791 1.0680 1.0765 1.9668 1.9454 2.9510 3.8463 3.9134 4.0450 3.5714 3.9677 3.6649 3.7874 3.9106 3.5292 3.9357 3.9316 4.0322 3.8095 3.8988 3.9380 3.9378 3.8389 1.0094 1.0233 1.0008 0.9923 1.0137 1.0066 1.0042 0.9884 1.0133 1.0014 1.0037 1.0034 1.0024 0.9981 1.0008 1.0003 0.9860
dispcorr: -0.019341513 hartree
energy: -1461.213142428404
dipole: 8.10249 -7.86605 0.23645 7.63511 -8.70871 -1.07360 8.77205 -9.79144 -1.01939
magnitude: 1.49923 au
magnitude: 3.81073 debye
