program: Orca
programVersion: 5.0.2
elementType: S F F O O N C C C C C C C C C C C C C C C C C H H H H H H H H H H H H H H H H H
charge: 0
multiplicity: 1
keywords: wb97x-d3
keywords: def2-TZVPP
keywords: def2/J RIJCOSX
keywords: DEFGRID2
keywords: scfconv7
keywords: smallprint printgap noloewdin
keywords: NOSOSCF
formula: C17H17F2NO2S
InChI: InChI=1/C17H17F2NO2S/c1-11-6-7-23-16(11)15-8-17(2,22-20-15)10-21-9-12-13(18)4-3-5-14(12)19/h3-7H,8-10H2,1-2H3
40 atoms
S  3.369317 0.670015 -0.992577
F  -4.644014 -1.669854 0.337129
F  -0.996622 -0.874926 -2.499308
O  -0.178047 1.863479 2.127956
O  -2.160126 1.146106 -0.798259
N  1.089872 1.353548 2.143539
C  -0.639274 2.065185 0.767842
C  0.599252 1.779416 -0.085251
C  -1.740077 1.032089 0.539417
C  1.555121 1.2875 0.9568
C  -1.143829 3.489051 0.640186
C  2.883241 0.800389 0.662429
C  3.887205 0.393784 1.513699
C  -3.202389 0.277951 -1.170688
C  -2.832703 -1.182266 -1.074946
C  5.040492 -0.019164 0.794421
C  3.811566 0.380081 3.004719
C  4.905691 0.076989 -0.55673
C  -3.552931 -2.095398 -0.316663
C  -1.72285 -1.700838 -1.732888
C  -3.213107 -3.429695 -0.200859
C  -1.330096 -3.020287 -1.645245
C  -2.088632 -3.884263 -0.869266
H  0.987029 2.675192 -0.57817
H  0.418907 1.0361 -0.86402
H  -2.573923 1.212697 1.232281
H  -1.34523 0.029394 0.753728
H  -1.986255 3.674725 1.308411
H  -0.352753 4.20099 0.879235
H  -1.473115 3.691486 -0.378504
H  -3.450553 0.530526 -2.203441
H  -4.098395 0.473833 -0.573833
H  5.94077 -0.374853 1.276654
H  4.76029 0.055024 3.429609
H  3.584041 1.367601 3.407804
H  3.033819 -0.294179 3.365806
H  5.63163 -0.173545 -1.315506
H  -3.816801 -4.094119 0.403055
H  -0.451611 -3.363861 -2.175103
H  -1.800785 -4.92347 -0.787762
elementType: S F O N C H
totalener: -1461.19375396 hartree
nucrepener: 2090.64040129 hartree
electener: -3551.83415525 hartree
oneelecener: -6159.38742729 hartree
twoeener: 2607.55327204 hartree
cpcmener: -0.02330536 hartree
kineticenergy: 1456.12549163 hartree
xcener: -118.600124319035 hartree
chargesum: -0.0000000
charge: 0.035631 -0.219816 -0.214655 -0.272637 -0.358734 -0.150586 0.310406 -0.125628 -0.090994 0.273801 -0.315138 -0.114489 -0.174431 0.052176 -0.184681 -0.144251 -0.216867 -0.185214 0.341077 0.265093 -0.223544 -0.217995 -0.109232 0.117489 0.108574 0.109646 0.109945 0.101683 0.104414 0.096693 0.118343 0.101734 0.151080 0.096361 0.099044 0.099724 0.162642 0.148713 0.150766 0.163857
qa: 0.0356 -0.2198 -0.2147 -0.2726 -0.3587 -0.1506 0.3104 -0.1256 -0.0910 0.2738 -0.3151 -0.1145 -0.1744 0.0522 -0.1847 -0.1443 -0.2169 -0.1852 0.3411 0.2651 -0.2235 -0.2180 -0.1092 0.1175 0.1086 0.1096 0.1099 0.1017 0.1044 0.0967 0.1183 0.1017 0.1511 0.0964 0.0990 0.0997 0.1626 0.1487 0.1508 0.1639
va: 2.7791 1.0679 1.0766 1.9654 1.9459 2.9526 3.8454 3.9123 4.0493 3.5726 3.9646 3.6626 3.7862 3.9110 3.5287 3.9349 3.9325 4.0328 3.8128 3.8985 3.9367 3.9371 3.8409 1.0098 1.0229 1.0010 0.9917 1.0066 1.0047 1.0137 0.9884 1.0133 1.0014 1.0025 1.0032 1.0029 0.9981 1.0008 1.0003 0.9860
dispcorr: -0.019406246 hartree
energy: -1461.213160205862
dipole: 8.07336 -7.80139 0.27197 7.71917 -8.80130 -1.08213 8.78423 -9.80566 -1.02144
magnitude: 1.51272 au
magnitude: 3.84502 debye
