program: Orca
programVersion: 5.0.2
elementType: S F F O O N C C C C C C C C C C C C C C C C C H H H H H H H H H H H H H H H H H
charge: 0
multiplicity: 1
keywords: wb97x-d3
keywords: def2-TZVPP
keywords: def2/J RIJCOSX
keywords: DEFGRID2
keywords: scfconv7
keywords: smallprint printgap noloewdin
keywords: NOSOSCF
formula: C17H17F2NO2S
InChI: InChI=1/C17H17F2NO2S/c1-11-6-7-23-16(11)15-8-17(2,22-20-15)10-21-9-12-13(18)4-3-5-14(12)19/h3-7H,8-10H2,1-2H3
40 atoms
S  2.463369 0.343092 -1.38389
F  -1.956293 -0.182609 -2.703368
F  -1.950983 -2.230286 1.507857
O  -0.198399 2.539132 2.063467
O  -2.761763 1.076923 -0.033325
N  0.90637 1.731035 1.946793
C  -0.99089 2.439046 0.857375
C  0.035702 2.004443 -0.180965
C  -2.010475 1.329335 1.131528
C  1.055501 1.384222 0.725456
C  -1.6417 3.774877 0.583951
C  2.094988 0.477338 0.298997
C  2.867662 -0.376626 1.05474
C  -3.170021 -0.26533 -0.187554
C  -2.022545 -1.16268 -0.579936
C  3.748266 -1.135709 0.239135
C  2.796381 -0.523825 2.538571
C  3.641636 -0.852522 -1.088487
C  -1.435785 -1.064557 -1.836822
C  -1.435088 -2.081407 0.278369
C  -0.347248 -1.81076 -2.234731
C  -0.338484 -2.851698 -0.061658
C  0.201382 -2.707175 -1.328845
H  0.47017 2.852776 -0.72061
H  -0.366431 1.318549 -0.92355
H  -2.671099 1.631991 1.954306
H  -1.474224 0.43374 1.466056
H  -2.298443 4.07261 1.40283
H  -0.892015 4.553853 0.441292
H  -2.243963 3.723872 -0.323012
H  -3.930396 -0.268809 -0.969527
H  -3.654639 -0.639838 0.718468
H  4.435796 -1.870072 0.636242
H  1.768071 -0.636751 2.883992
H  3.362211 -1.396052 2.863402
H  3.20588 0.347265 3.05198
H  4.200636 -1.284757 -1.904974
H  0.067606 -1.687599 -3.22608
H  0.081609 -3.547587 0.652212
H  1.062559 -3.295791 -1.614533
elementType: S F O N C H
totalener: -1461.19213367 hartree
nucrepener: 2235.80046774 hartree
electener: -3696.99260140 hartree
oneelecener: -6449.43187983 hartree
twoeener: 2752.43927843 hartree
cpcmener: -0.02377946 hartree
kineticenergy: 1456.14021155 hartree
xcener: -118.605645131155 hartree
chargesum: 0.0000000
charge: 0.039892 -0.218157 -0.220125 -0.281318 -0.372548 -0.141730 0.324875 -0.139982 -0.117455 0.199017 -0.281899 -0.054362 -0.189152 0.053310 -0.145457 -0.136357 -0.220821 -0.184433 0.267775 0.326496 -0.239375 -0.222078 -0.099761 0.122671 0.121550 0.113438 0.108607 0.101966 0.098278 0.096834 0.116127 0.108335 0.151756 0.098619 0.096931 0.103278 0.161030 0.144481 0.148603 0.161139
qa: 0.0399 -0.2182 -0.2201 -0.2813 -0.3725 -0.1417 0.3249 -0.1400 -0.1175 0.1990 -0.2819 -0.0544 -0.1892 0.0533 -0.1455 -0.1364 -0.2208 -0.1844 0.2678 0.3265 -0.2394 -0.2221 -0.0998 0.1227 0.1216 0.1134 0.1086 0.1020 0.0983 0.0968 0.1161 0.1083 0.1518 0.0986 0.0969 0.1033 0.1610 0.1445 0.1486 0.1611
va: 2.7498 1.0688 1.0646 1.9692 1.9322 2.9319 3.8640 3.9050 4.0671 3.6251 3.9127 3.6308 3.7794 3.9093 3.5275 3.9087 3.9298 4.0054 3.8323 3.7685 3.9015 3.8970 3.7703 1.0128 1.0102 1.0062 0.9812 1.0067 1.0104 1.0137 0.9933 1.0046 1.0007 1.0048 1.0021 1.0008 0.9972 1.0063 1.0004 0.9874
dispcorr: -0.024732083 hartree
energy: -1461.216865749815
dipole: 4.23637 -3.69090 0.54547 5.89147 -7.36125 -1.46978 7.11429 -8.35418 -1.23989
magnitude: 1.99878 au
magnitude: 5.08050 debye
