program: Orca
programVersion: 5.0.2
elementType: S F F O O N C C C C C C C C C C C C C C C C C H H H H H H H H H H H H H H H H H
charge: 0
multiplicity: 1
keywords: wb97x-d3
keywords: def2-TZVPP
keywords: def2/J RIJCOSX
keywords: DEFGRID2
keywords: scfconv7
keywords: smallprint printgap noloewdin
keywords: NOSOSCF
formula: C17H17F2NO2S
InChI: InChI=1/C17H17F2NO2S/c1-11-6-7-23-16(11)15-8-17(2,22-20-15)10-21-9-12-13(18)4-3-5-14(12)19/h3-7H,8-10H2,1-2H3
40 atoms
S  2.977882 0.670109 -1.074152
F  -3.98724 -2.266335 0.555494
F  -0.578607 -0.653132 -2.216464
O  -0.444098 2.339449 1.971617
O  -1.765744 0.72338 0.100544
N  0.641807 1.512703 1.979956
C  -0.725951 2.806626 0.626937
C  0.512548 2.381724 -0.165275
C  -1.985465 2.109631 0.140733
C  1.187688 1.487066 0.82637
C  -0.938898 4.305997 0.673409
C  2.362993 0.696069 0.541087
C  3.123512 -0.087819 1.3806
C  -2.761964 0.026756 -0.611738
C  -2.301272 -1.385946 -0.811865
C  4.204249 -0.694486 0.686339
C  2.873014 -0.291736 2.838025
C  4.250754 -0.37532 -0.636238
C  -2.91449 -2.479471 -0.218948
C  -1.197233 -1.673422 -1.606213
C  -2.48414 -3.781029 -0.3956
C  -0.719621 -2.950452 -1.813546
C  -1.37696 -4.005863 -1.197452
H  1.156995 3.229044 -0.417394
H  0.26709 1.874345 -1.099505
H  -2.230869 2.498398 -0.857713
H  -2.829674 2.358659 0.799807
H  -0.053378 4.812172 1.058626
H  -1.134065 4.691415 -0.327811
H  -1.787864 4.571427 1.3052
H  -2.940287 0.4974 -1.587194
H  -3.717493 0.052085 -0.078464
H  4.922177 -1.34665 1.164684
H  1.893263 -0.733727 3.021621
H  3.625249 -0.952921 3.266062
H  2.900077 0.649469 3.388613
H  4.968786 -0.702743 -1.373045
H  -3.004098 -4.598219 0.086131
H  0.143402 -3.116202 -2.444337
H  -1.022289 -5.016464 -1.348009
elementType: S F O N C H
totalener: -1461.19485408 hartree
nucrepener: 2134.89687699 hartree
electener: -3596.09173106 hartree
oneelecener: -6249.01936299 hartree
twoeener: 2652.92763193 hartree
cpcmener: -0.02856923 hartree
kineticenergy: 1456.14572376 hartree
xcener: -118.603084532003 hartree
chargesum: -0.0000000
charge: 0.033720 -0.217447 -0.216390 -0.274111 -0.343413 -0.142466 0.315440 -0.136103 -0.089294 0.253171 -0.310920 -0.103382 -0.168851 0.075677 -0.188264 -0.146018 -0.216080 -0.188128 0.323185 0.287238 -0.228960 -0.223970 -0.100545 0.122541 0.110849 0.096657 0.102433 0.103504 0.101921 0.105005 0.103610 0.090770 0.151615 0.098867 0.096248 0.099316 0.162247 0.148219 0.149333 0.162777
qa: 0.0337 -0.2174 -0.2164 -0.2741 -0.3434 -0.1425 0.3154 -0.1361 -0.0893 0.2532 -0.3109 -0.1034 -0.1689 0.0757 -0.1883 -0.1460 -0.2161 -0.1881 0.3232 0.2872 -0.2290 -0.2240 -0.1005 0.1225 0.1108 0.0967 0.1024 0.1035 0.1019 0.1050 0.1036 0.0908 0.1516 0.0989 0.0962 0.0993 0.1622 0.1482 0.1493 0.1628
va: 2.7747 1.0745 1.0716 1.9667 1.9666 2.9457 3.8029 3.9305 4.0440 3.5689 3.9706 3.6340 3.7803 3.8873 3.6625 3.9347 3.9284 4.0308 3.8530 3.8585 3.9420 3.9597 3.8417 1.0127 1.0153 0.9944 1.0014 1.0053 1.0019 1.0067 0.9919 1.0052 1.0013 1.0044 1.0025 1.0030 0.9982 1.0012 1.0014 0.9859
dispcorr: -0.019449356 hartree
energy: -1461.214303431651
dipole: 5.33233 -5.20676 0.12557 11.04555 -11.25061 -0.20506 5.77972 -7.62975 -1.85003
magnitude: 1.86560 au
magnitude: 4.74197 debye
