program: Gaussian 09
title: 000059824
version: EM64L-G09RevD.01
frameworkgroup: C1[X(C11H17NO2)]
method: RPBEPBE
basis: SDD
operation: Freq
keyword: #p
keyword: freq=noraman
keyword: PBEPBE/SDD
title: #p freq=noraman PBEPBE/SDD
converged: YES YES NO NO
title: Mulliken charges:
elementType: O O N C C C C C C C C C C C H H H H H H H H H H H H H H H H H
charge: -0.287224 -0.297434 -0.710776 -0.385683 -0.341080 -0.279723 0.245546 -0.687307 0.206525 -0.294956 -0.557906 0.560978 -0.475924 -0.524990 0.202923 0.212379 0.194519 0.192435 0.200789 0.194934 0.213134 0.211091 0.217087 0.241116 0.241088 0.213095 0.300719 0.303016 0.260539 0.207047 0.224039
chargesum: 0.00000
title: Mulliken charges with hydrogens summed into heavy atoms:
elementType: O O N C C C C C C C C C C C
charge: -0.287224 -0.297434 -0.107041 0.029620 0.045875 0.116000 0.245546 -0.045994 0.206525 -0.053839 -0.316818 0.560978 -0.262829 0.166635
polarizability: 1.93618530e+02 1.23662644e+01 1.43937269e+02 3.27599041e+00 -3.66991032e+00 8.04845299e+01
1716.lowfreq: -8.5814 -0.0004 0.0002 0.0005 4.2608 12.2995 31.5220 57.9433 65.7301
frequency: 31.3304 57.8659 65.7235 66.7383 97.4976 122.5886 143.4093 154.8270 185.4985 201.3919 222.7685 230.4055 285.7888 292.8117 323.9233 328.9377 353.0970 374.6074 425.7089 457.9993 486.4283 506.7057 598.1362 636.2958 707.8469 718.7514 744.6043 753.9399 781.8815 819.1666 859.0643 895.1150 896.6248 904.3231 942.4383 972.8375 988.8797 1035.7039 1043.3644 1083.9070 1110.3572 1113.1562 1124.4266 1145.1128 1157.1214 1177.2516 1205.6471 1213.2212 1262.8332 1274.0836 1279.5920 1285.5085 1329.0722 1348.2166 1368.9901 1389.3657 1394.5695 1420.4172 1450.7078 1456.1621 1469.8776 1473.6753 1477.3707 1482.7912 1483.4530 1490.7689 1506.2044 1580.5098 1632.2122 1644.7322 2936.0380 2967.1791 2969.0557 2975.5085 2990.1385 2992.6631 3010.8102 3056.3188 3073.7708 3075.5431 3077.5769 3121.2848 3126.3069 3146.7884 3159.6369 3574.9135 3716.1125
redmass: 3.8819 1.7937 2.4858 2.4799 2.8948 1.9289 1.7323 2.8617 3.3838 3.4165 4.2310 1.1286 2.1634 1.6584 3.1475 1.0916 5.2167 3.8531 3.5684 3.2471 4.1984 5.5584 4.4606 3.4709 5.2595 3.2409 1.0798 6.2029 1.5099 1.1426 1.7475 2.9144 1.6976 1.8649 1.1476 6.3415 2.9926 1.6731 2.8967 2.2060 2.4467 1.2425 2.6154 1.4416 1.3661 1.7377 2.0896 1.3767 1.6722 1.2816 1.1779 1.0816 2.9825 1.4822 2.4903 1.6588 1.4930 1.4909 1.5425 1.4095 1.0767 1.0754 1.0426 1.1180 1.0568 1.1536 2.5284 7.3614 1.5973 2.5813 1.0550 1.0588 1.0356 1.0365 1.0906 1.0737 1.1007 1.1042 1.1012 1.0995 1.0956 1.1045 1.0884 1.0913 1.0941 1.0447 1.1041
irintensity: 0.6582 0.3917 3.2729 3.5273 1.9302 5.7429 0.8907 1.3068 0.5693 2.3261 4.2180 0.0214 103.4577 227.0025 0.3169 0.0832 0.4613 1.0178 0.8450 6.8187 0.6361 2.2362 4.0452 8.2740 3.0168 3.0722 12.2692 34.8737 41.4704 2.4202 41.6016 5.9273 3.3378 21.2754 0.4996 68.3180 37.6082 2.4943 31.7824 12.4637 107.9183 6.8672 8.6398 1.6529 6.2913 20.1380 284.7696 0.1715 33.1588 3.8286 0.9322 0.1644 20.0380 0.7282 38.1407 18.6408 16.0671 0.8965 5.6610 17.4962 4.1828 2.7826 13.2403 48.6557 18.9380 67.0061 217.4503 31.9121 13.4251 238.3077 41.0751 35.8049 85.8668 35.3459 30.5068 39.9429 5.4786 22.6503 97.1391 51.8031 41.4966 18.9880 22.1728 14.0723 12.7433 65.8971 19.0143
temp: 298.150 k
press: 1.00000 atm
elementType: 8 8 7 6 6 6 6 6 6 6 6 6 6 6 1 1 1 1 1 1 1 1 1 1 1 1 1 1 1 1 1
symmnumber: 1
zpe: 684957.7 jmol-1
zpe.correction: 0.260887 hartree
zpe.thermalcorrener: 0.276874 hartree
zpe.thermalcorrenthalpy: 0.277818 hartree
zpe.thermalcorrgfe: 0.216926 hartree
zpe.sumelectzpe: -633.453531 hartree
zpe.sumelectthermal: -633.437544 hartree
zpe.sumelectthermalent: -633.436599 hartree
zpe.sumelectthermalfe: -633.497491 hartree
dipole: 0.0738 -1.9410 1.3181
dipole: 2.3474
quadrupole: -63.5448 -77.9062 -89.3478
quadrupole: 4.1803 -0.1566 2.5703
quadrupole: 13.3881 -0.9732 -12.4149 4.1803 -0.1566 2.5703
hfenergy: -633.7144175 hartree
pointgroup: C01 [X(C11H17N1O2)]
dipole: 0.065559 -0.7410895 0.5471908 debye
polarizability: 192.2262349|14.9440062|144.9513289|3.2870624|-5.883273|80.8627657 unknown
InChI: InChI=1S/C11H17NO2/c1-3-4-7-14-10-6-5-9(12)8-11(10)13-2/h5-6,8H,3-4,7,12H2,1-2H3
charge 0 multiplicity 1
31 atoms
O  0.810154 0.400682 -0.061942
O  -1.37445 2.179158 -0.57062
N  -4.570621 -1.419069 -0.080457
C  3.219929 0.199197 -0.09312
C  4.452951 -0.731186 -0.012601
C  1.906643 -0.572108 0.061387
C  -0.511183 -0.104733 -0.013344
C  5.782037 0.038608 -0.167535
C  -1.573254 0.82042 -0.252682
C  -0.839242 -1.458823 0.225783
C  -2.908681 0.373373 -0.2696
C  -3.236239 -0.993126 -0.050263
C  -2.178296 -1.905181 0.208145
C  -0.526063 2.976007 0.337257
H  3.281627 0.97224 0.697379
H  3.210587 0.730395 -1.06422
H  4.381199 -1.507258 -0.801733
H  4.448442 -1.269313 0.957455
H  1.806689 -1.346712 -0.72887
H  1.857848 -1.073066 1.052343
H  5.827293 0.557704 -1.143175
H  5.891779 0.803315 0.624239
H  6.651465 -0.640895 -0.104749
H  -0.047895 -2.190602 0.414134
H  -3.687128 1.119373 -0.463817
H  -2.398228 -2.963898 0.388883
H  -4.808606 -2.391741 0.08428
H  -5.32057 -0.765309 -0.280585
H  0.50784 2.594851 0.350863
H  -0.944428 2.96803 1.363215
H  -0.5595 3.998566 -0.070052
