program: Orca
programVersion: 5.0.2
elementType: S F F O O N C C C C C C C C C C C C C C C C C H H H H H H H H H H H H H H H H H
charge: 0
multiplicity: 1
keywords: wb97x-d3
keywords: def2-TZVPP
keywords: def2/J RIJCOSX
keywords: DEFGRID2
keywords: scfconv7
keywords: smallprint printgap noloewdin
keywords: NOSOSCF
formula: C17H17F2NO2S
InChI: InChI=1/C17H17F2NO2S/c1-11-6-7-23-16(11)15-8-17(2,22-20-15)10-21-9-12-13(18)4-3-5-14(12)19/h3-7H,8-10H2,1-2H3
40 atoms
S  3.414512 0.181094 2.087754
F  -4.322388 -1.663628 0.475951
F  -0.747109 -0.997754 -2.469643
O  -0.336368 2.327903 1.798513
O  -2.162417 1.140544 -1.076986
N  0.84131 1.640066 1.927036
C  -0.75014 2.339928 0.412322
C  0.526291 1.968284 -0.342372
C  -1.811966 1.248097 0.281427
C  1.345667 1.410039 0.777047
C  -1.288039 3.714579 0.077559
C  2.602083 0.705747 0.651948
C  3.305714 0.364212 -0.480487
C  -3.080652 0.114848 -1.372248
C  -2.560832 -1.254087 -1.01334
C  4.507934 -0.325583 -0.155299
C  2.912155 0.63649 -1.899196
C  4.693457 -0.493092 1.180707
C  -3.174137 -2.076209 -0.079098
C  -1.378265 -1.745256 -1.553156
C  -2.664417 -3.299057 0.313812
C  -0.818259 -2.953771 -1.196104
C  -1.474469 -3.728626 -0.250678
H  1.025359 2.836669 -0.783029
H  0.350629 1.256343 -1.145799
H  -2.686484 1.502445 0.896725
H  -1.405196 0.302756 0.665773
H  -1.588044 3.762702 -0.969024
H  -2.160087 3.96109 0.685653
H  -0.52808 4.479871 0.239667
H  -3.270203 0.176836 -2.445291
H  -4.037283 0.295075 -0.872423
H  5.204497 -0.679289 -0.903099
H  3.720211 0.354127 -2.572872
H  2.032218 0.063122 -2.19477
H  2.693976 1.688873 -2.077951
H  5.521027 -0.979149 1.675807
H  -3.185271 -3.89646 1.050082
H  0.109319 -3.281226 -1.646418
H  -1.052677 -4.678816 0.047494
elementType: S F O N C H
totalener: -1461.19304777 hartree
nucrepener: 2130.04406068 hartree
electener: -3591.23710845 hartree
oneelecener: -6237.97202955 hartree
twoeener: 2646.73492110 hartree
cpcmener: -0.02576226 hartree
kineticenergy: 1456.14144971 hartree
xcener: -118.604412035468 hartree
chargesum: 0.0000000
charge: 0.048028 -0.219388 -0.217406 -0.277409 -0.357683 -0.140361 0.330331 -0.108897 -0.112809 0.173666 -0.303277 -0.074907 -0.123970 0.051164 -0.179408 -0.167726 -0.255071 -0.178386 0.345364 0.258790 -0.223164 -0.219086 -0.107517 0.113471 0.105719 0.110061 0.109145 0.096421 0.101906 0.100729 0.119127 0.101426 0.150161 0.103313 0.107697 0.113591 0.160556 0.149694 0.152385 0.163719
qa: 0.0480 -0.2194 -0.2174 -0.2774 -0.3577 -0.1404 0.3303 -0.1089 -0.1128 0.1737 -0.3033 -0.0749 -0.1240 0.0512 -0.1794 -0.1677 -0.2551 -0.1784 0.3454 0.2588 -0.2232 -0.2191 -0.1075 0.1135 0.1057 0.1101 0.1091 0.0964 0.1019 0.1007 0.1191 0.1014 0.1502 0.1033 0.1077 0.1136 0.1606 0.1497 0.1524 0.1637
va: 2.7877 1.0683 1.0733 1.9701 1.9466 2.9629 3.8841 3.9094 4.0583 3.7062 3.9367 3.5834 3.7344 3.9059 3.5783 3.9465 3.9292 4.0355 3.8090 3.8778 3.9396 3.9397 3.8426 1.0076 1.0305 1.0034 0.9920 1.0137 1.0070 1.0081 0.9894 1.0134 1.0031 1.0033 0.9995 0.9906 0.9983 1.0003 0.9986 0.9859
dispcorr: -0.020660383 hartree
energy: -1461.213708157065
dipole: 5.41302 -5.08667 0.32635 9.22570 -10.43154 -1.20584 -7.95773 6.09353 -1.86420
magnitude: 2.24406 au
magnitude: 5.70394 debye
