program: Orca
programVersion: 5.0.2
elementType: S F F O O N C C C C C C C C C C C C C C C C C H H H H H H H H H H H H H H H H H
charge: 0
multiplicity: 1
keywords: wb97x-d3
keywords: def2-TZVPP
keywords: def2/J RIJCOSX
keywords: DEFGRID2
keywords: scfconv7
keywords: smallprint printgap noloewdin
keywords: NOSOSCF
formula: C17H17F2NO2S
InChI: InChI=1/C17H17F2NO2S/c1-11-6-7-23-16(11)15-8-17(2,22-20-15)10-21-9-12-13(18)4-3-5-14(12)19/h3-7H,8-10H2,1-2H3
40 atoms
S  3.357448 0.196846 2.236264
F  -0.75081 -0.884109 -2.614381
F  -4.284437 -1.7715 0.321855
O  -0.439304 2.232473 1.889941
O  -2.166089 1.146056 -1.085586
N  0.757704 1.584857 2.030642
C  -0.80545 2.299261 0.491261
C  0.499217 1.971709 -0.238033
C  -1.853972 1.206173 0.28488
C  1.30536 1.411264 0.890825
C  -1.344154 3.684053 0.20006
C  2.587664 0.752325 0.788232
C  3.343385 0.469282 -0.326448
C  -3.077564 0.130447 -1.434867
C  -2.538986 -1.249298 -1.152289
C  4.545813 -0.209034 0.020926
C  3.001794 0.793214 -1.747804
C  4.681192 -0.425196 1.356069
C  -1.353578 -1.689713 -1.728331
C  -3.132301 -2.132082 -0.261787
C  -0.767813 -2.904182 -1.439299
C  -2.597861 -3.365538 0.059581
C  -1.402943 -3.740822 -0.532513
H  0.985157 2.858969 -0.653783
H  0.360853 1.266478 -1.055395
H  -2.74785 1.431392 0.883131
H  -1.450231 0.250109 0.645181
H  -2.236165 3.896498 0.791768
H  -0.595577 4.445813 0.421494
H  -1.611713 3.778804 -0.852109
H  -3.271319 0.248522 -2.502487
H  -4.033802 0.273858 -0.922475
H  5.279017 -0.520523 -0.710477
H  3.845041 0.562371 -2.397505
H  2.150531 0.211845 -2.105748
H  2.762539 1.846726 -1.889608
H  5.49841 -0.913108 1.866336
H  0.163038 -3.189073 -1.911529
H  -3.104165 -4.01273 0.763399
H  -0.961684 -4.697429 -0.287563
elementType: S F O N C H
totalener: -1461.19329432 hartree
nucrepener: 2124.43738402 hartree
electener: -3585.63067834 hartree
oneelecener: -6226.75596400 hartree
twoeener: 2641.12528566 hartree
cpcmener: -0.02595865 hartree
kineticenergy: 1456.13378173 hartree
xcener: -118.602570944364 hartree
chargesum: 0.0000000
charge: 0.047425 -0.218101 -0.219571 -0.276234 -0.357997 -0.140572 0.328007 -0.109187 -0.112155 0.178220 -0.305670 -0.076653 -0.124041 0.050568 -0.180648 -0.167781 -0.254868 -0.178875 0.261407 0.344244 -0.219877 -0.221653 -0.109037 0.114121 0.105735 0.109594 0.110689 0.101744 0.101372 0.096858 0.119559 0.101893 0.149853 0.103663 0.108741 0.112677 0.160474 0.152067 0.149835 0.164174
qa: 0.0474 -0.2181 -0.2196 -0.2762 -0.3580 -0.1406 0.3280 -0.1092 -0.1122 0.1782 -0.3057 -0.0767 -0.1240 0.0506 -0.1806 -0.1678 -0.2549 -0.1789 0.2614 0.3442 -0.2199 -0.2217 -0.1090 0.1141 0.1057 0.1096 0.1107 0.1017 0.1014 0.0969 0.1196 0.1019 0.1499 0.1037 0.1087 0.1127 0.1605 0.1521 0.1498 0.1642
va: 2.7876 1.0722 1.0679 1.9703 1.9449 2.9636 3.8777 3.9186 4.0618 3.7038 3.9413 3.5800 3.7368 3.9062 3.5718 3.9456 3.9305 4.0348 3.8811 3.8086 3.9404 3.9376 3.8426 1.0072 1.0279 1.0030 0.9913 1.0070 1.0075 1.0133 0.9897 1.0132 1.0032 1.0033 0.9986 0.9912 0.9983 0.9986 1.0002 0.9859
dispcorr: -0.020473983 hartree
energy: -1461.213768305408
dipole: 5.70938 -5.29773 0.41165 9.61052 -10.71976 -1.10923 -7.31249 5.41089 -1.90160
magnitude: 2.23963 au
magnitude: 5.69268 debye
