program: Orca
programVersion: 5.0.2
elementType: S F F O O N C C C C C C C C C C C C C C C C C H H H H H H H H H H H H H H H H H
charge: 0
multiplicity: 1
keywords: wb97x-d3
keywords: def2-TZVPP
keywords: def2/J RIJCOSX
keywords: DEFGRID2
keywords: scfconv7
keywords: smallprint printgap noloewdin
keywords: NOSOSCF
formula: C17H17F2NO2S
InChI: InChI=1/C17H17F2NO2S/c1-11-6-7-23-16(11)15-8-17(2,22-20-15)10-21-9-12-13(18)4-3-5-14(12)19/h3-7H,8-10H2,1-2H3
40 atoms
S  2.91192 1.012555 -0.970989
F  -0.445411 -0.433577 -2.229726
F  -3.749772 -2.565502 0.312381
O  -0.626664 2.14729 2.185441
O  -1.802974 0.633954 0.15838
N  0.485857 1.357089 2.112779
C  -0.926372 2.727117 0.890477
C  0.347289 2.469021 0.084802
C  -2.125094 1.991407 0.312221
C  1.043071 1.484168 0.971304
C  -1.247373 4.195463 1.079358
C  2.241816 0.766651 0.604466
C  2.989542 -0.131808 1.333201
C  -2.718746 -0.076307 -0.64162
C  -2.131335 -1.423861 -0.942275
C  4.104009 -0.603327 0.589228
C  2.692536 -0.573594 2.72783
C  4.188645 -0.073697 -0.6621
C  -0.986915 -1.54815 -1.722205
C  -2.651763 -2.613426 -0.45424
C  -0.389217 -2.755352 -2.015722
C  -2.100567 -3.852356 -0.722162
C  -0.960614 -3.912181 -1.506611
H  0.95588 3.370769 -0.030849
H  0.148105 2.081596 -0.915407
H  -2.376941 2.450495 -0.653906
H  -2.997187 2.121298 0.968669
H  -1.456798 4.662722 0.116601
H  -2.121713 4.337428 1.716309
H  -0.406119 4.723071 1.529292
H  -2.911037 0.459782 -1.579767
H  -3.686546 -0.17612 -0.140007
H  4.816673 -1.316583 0.980544
H  3.415445 -1.320207 3.053918
H  2.730199 0.259081 3.432116
H  1.695925 -1.008561 2.810608
H  4.935087 -0.269933 -1.417014
H  0.500604 -2.787984 -2.630244
H  -2.555035 -4.748535 -0.321537
H  -0.512063 -4.871269 -1.726886
elementType: S F O N C H
totalener: -1461.19465559 hartree
nucrepener: 2147.53846629 hartree
electener: -3608.73312188 hartree
oneelecener: -6274.33790590 hartree
twoeener: 2665.60478402 hartree
cpcmener: -0.02865586 hartree
kineticenergy: 1456.14894116 hartree
xcener: -118.603825282435 hartree
chargesum: -0.0000000
charge: 0.034500 -0.215843 -0.217217 -0.276335 -0.341613 -0.140986 0.320437 -0.136802 -0.092553 0.244846 -0.306774 -0.102779 -0.163986 0.074504 -0.186344 -0.146494 -0.215565 -0.188356 0.286164 0.320952 -0.222530 -0.228019 -0.101306 0.123204 0.109904 0.096591 0.102330 0.102034 0.104749 0.102296 0.103262 0.091071 0.150799 0.096012 0.099990 0.097884 0.162157 0.148795 0.148136 0.162882
qa: 0.0345 -0.2158 -0.2172 -0.2763 -0.3416 -0.1410 0.3204 -0.1368 -0.0926 0.2448 -0.3068 -0.1028 -0.1640 0.0745 -0.1863 -0.1465 -0.2156 -0.1884 0.2862 0.3210 -0.2225 -0.2280 -0.1013 0.1232 0.1099 0.0966 0.1023 0.1020 0.1047 0.1023 0.1033 0.0911 0.1508 0.0960 0.1000 0.0979 0.1622 0.1488 0.1481 0.1629
va: 2.7717 1.0718 1.0745 1.9655 1.9685 2.9437 3.8017 3.9289 4.0464 3.5769 3.9639 3.6295 3.7758 3.8899 3.6634 3.9354 3.9276 4.0304 3.8538 3.8566 3.9583 3.9396 3.8422 1.0125 1.0155 0.9945 1.0010 1.0019 1.0068 1.0061 0.9922 1.0044 1.0015 1.0023 1.0027 1.0054 0.9981 1.0018 1.0011 0.9860
dispcorr: -0.019799547 hartree
energy: -1461.214455141482
dipole: 4.00804 -3.84823 0.15981 10.28020 -10.32331 -0.04311 6.56008 -8.43936 -1.87928
magnitude: 1.88656 au
magnitude: 4.79524 debye
