program: Orca
programVersion: 5.0.2
elementType: S F F O O N C C C C C C C C C C C C C C C C C H H H H H H H H H H H H H H H H H
charge: 0
multiplicity: 1
keywords: wb97x-d3
keywords: def2-TZVPP
keywords: def2/J RIJCOSX
keywords: DEFGRID2
keywords: scfconv7
keywords: smallprint printgap noloewdin
keywords: NOSOSCF
formula: C17H17F2NO2S
InChI: InChI=1/C17H17F2NO2S/c1-11-6-7-23-16(11)15-8-17(2,22-20-15)10-21-9-12-13(18)4-3-5-14(12)19/h3-7H,8-10H2,1-2H3
40 atoms
S  2.851737 0.651637 -1.115861
F  -3.833153 -2.235751 0.551925
F  -0.421679 -0.606176 -2.206473
O  -0.49348 2.377928 1.986641
O  -1.762084 0.772471 0.09106
N  0.555624 1.503491 1.967203
C  -0.775008 2.865136 0.649007
C  0.472198 2.463039 -0.140046
C  -2.018771 2.151929 0.142211
C  1.102711 1.496719 0.813881
C  -1.008372 4.359542 0.720733
C  2.230294 0.65022 0.496927
C  2.92881 -0.221592 1.303288
C  -2.68048 0.048474 -0.6932
C  -2.160157 -1.351267 -0.827354
C  3.968427 -0.871768 0.58627
C  2.651118 -0.477939 2.74749
C  4.046042 -0.498229 -0.720656
C  -2.736788 -2.440162 -0.190975
C  -1.018441 -1.62457 -1.571725
C  -2.243898 -3.727304 -0.289694
C  -0.477611 -2.886828 -1.700265
C  -1.105937 -3.940014 -1.050936
H  1.141764 3.30915 -0.320873
H  0.238071 2.022407 -1.110275
H  -2.263981 2.547654 -0.853161
H  -2.873269 2.372351 0.797596
H  -1.19915 4.760974 -0.274846
H  -1.866618 4.60254 1.349099
H  -0.133358 4.869943 1.123739
H  -2.788067 0.503152 -1.686078
H  -3.678079 0.051679 -0.242704
H  4.634622 -1.5946 1.03735
H  3.375423 -1.181372 3.156152
H  2.698941 0.436671 3.339568
H  1.654934 -0.896547 2.897623
H  4.74413 -0.843295 -1.468757
H  -2.738967 -4.542316 0.221196
H  0.412348 -3.043162 -2.295132
H  -0.702132 -4.939346 -1.140316
elementType: S F O N C H
totalener: -1461.19429254 hartree
nucrepener: 2159.08979042 hartree
electener: -3620.28408296 hartree
oneelecener: -6297.48083967 hartree
twoeener: 2677.19675671 hartree
cpcmener: -0.02858241 hartree
kineticenergy: 1456.14866223 hartree
xcener: -118.603633280074 hartree
chargesum: 0.0000000
charge: 0.035148 -0.217513 -0.215729 -0.276910 -0.340136 -0.141629 0.321954 -0.135506 -0.092797 0.238536 -0.306644 -0.099076 -0.163201 0.073559 -0.187722 -0.146590 -0.214406 -0.189457 0.323235 0.287619 -0.229686 -0.221466 -0.101041 0.122056 0.109874 0.095254 0.103156 0.102147 0.105038 0.101974 0.103355 0.090645 0.151473 0.095989 0.097565 0.099449 0.161983 0.148328 0.148517 0.162653
qa: 0.0351 -0.2175 -0.2157 -0.2769 -0.3401 -0.1416 0.3220 -0.1355 -0.0928 0.2385 -0.3066 -0.0991 -0.1632 0.0736 -0.1877 -0.1466 -0.2144 -0.1895 0.3232 0.2876 -0.2297 -0.2215 -0.1010 0.1221 0.1099 0.0953 0.1032 0.1021 0.1050 0.1020 0.1034 0.0906 0.1515 0.0960 0.0976 0.0994 0.1620 0.1483 0.1485 0.1627
va: 2.7715 1.0750 1.0719 1.9647 1.9691 2.9393 3.7976 3.9301 4.0484 3.5831 3.9625 3.6243 3.7739 3.8922 3.6731 3.9332 3.9273 4.0283 3.8568 3.8469 3.9405 3.9560 3.8423 1.0130 1.0145 0.9948 1.0019 1.0019 1.0066 1.0064 0.9932 1.0033 1.0013 1.0025 1.0041 1.0045 0.9982 1.0009 1.0021 0.9859
dispcorr: -0.020166638 hartree
energy: -1461.214459172888
dipole: 4.56856 -4.42879 0.13977 10.63503 -10.85785 -0.22282 5.79607 -7.64940 -1.85333
magnitude: 1.87191 au
magnitude: 4.75801 debye
