program: Orca
programVersion: 5.0.2
elementType: S F F O O N C C C C C C C C C C C C C C C C C H H H H H H H H H H H H H H H H H
charge: 0
multiplicity: 1
keywords: wb97x-d3
keywords: def2-TZVPP
keywords: def2/J RIJCOSX
keywords: DEFGRID2
keywords: scfconv7
keywords: smallprint printgap noloewdin
keywords: NOSOSCF
formula: C17H17F2NO2S
InChI: InChI=1/C17H17F2NO2S/c1-11-6-7-23-16(11)15-8-17(2,22-20-15)10-21-9-12-13(18)4-3-5-14(12)19/h3-7H,8-10H2,1-2H3
40 atoms
S  2.930295 0.264264 -1.151653
F  -4.624322 -1.205831 -0.349483
F  -0.029672 -2.09638 -0.406616
O  -0.211163 2.32609 1.957773
O  -1.362704 -0.093054 1.285891
N  1.036257 1.77216 1.952684
C  -0.856094 2.152508 0.670219
C  0.281685 1.674569 -0.236208
C  -1.94326 1.102594 0.82891
C  1.345647 1.386378 0.775864
C  -1.457704 3.477577 0.248416
C  2.617429 0.771664 0.470627
C  3.690766 0.511173 1.293955
C  -2.18084 -1.230713 1.142611
C  -2.319885 -1.632824 -0.302743
C  4.754549 -0.10285 0.580381
C  3.761783 0.824651 2.751862
C  4.483993 -0.301095 -0.739017
C  -3.513936 -1.572907 -1.006104
C  -1.206827 -2.017687 -1.041666
C  -3.619224 -1.865873 -2.352881
C  -1.251876 -2.322871 -2.385976
C  -2.474071 -2.238639 -3.037818
H  0.613995 2.453863 -0.929729
H  0.011945 0.8035 -0.836604
H  -2.429241 0.97575 -0.148118
H  -2.712102 1.456023 1.531036
H  -1.942256 3.379398 -0.7234
H  -2.206422 3.823264 0.962595
H  -0.686496 4.243259 0.161909
H  -3.165687 -1.07025 1.592621
H  -1.701477 -2.028927 1.712015
H  5.688952 -0.388738 1.043314
H  3.666988 1.89501 2.939613
H  2.962759 0.335236 3.310506
H  4.713646 0.49364 3.165825
H  5.122654 -0.744264 -1.487997
H  -4.575707 -1.797939 -2.853277
H  -0.353038 -2.618097 -2.910816
H  -2.533474 -2.467886 -4.092966
elementType: S F O N C H
totalener: -1461.19444478 hartree
nucrepener: 2147.55676587 hartree
electener: -3608.75121065 hartree
oneelecener: -6273.80621703 hartree
twoeener: 2665.05500638 hartree
cpcmener: -0.02888835 hartree
kineticenergy: 1456.14199941 hartree
xcener: -118.604327826994 hartree
chargesum: -0.0000000
charge: 0.033864 -0.219961 -0.213819 -0.275790 -0.341517 -0.142983 0.338219 -0.142975 -0.119357 0.251424 -0.305485 -0.099708 -0.170298 0.045636 -0.152214 -0.146572 -0.214103 -0.188658 0.323322 0.228566 -0.208837 -0.204550 -0.118313 0.125849 0.112627 0.102565 0.104878 0.101668 0.104355 0.102900 0.101854 0.117573 0.151408 0.098295 0.098206 0.095932 0.162239 0.149663 0.150701 0.163393
qa: 0.0339 -0.2200 -0.2138 -0.2758 -0.3415 -0.1430 0.3382 -0.1430 -0.1194 0.2514 -0.3055 -0.0997 -0.1703 0.0456 -0.1522 -0.1466 -0.2141 -0.1887 0.3233 0.2286 -0.2088 -0.2045 -0.1183 0.1258 0.1126 0.1026 0.1049 0.1017 0.1044 0.1029 0.1019 0.1176 0.1514 0.0983 0.0982 0.0959 0.1622 0.1497 0.1507 0.1634
va: 2.7762 1.0647 1.0735 1.9656 1.9713 2.9481 3.7759 3.9341 4.0858 3.5772 3.9654 3.6509 3.7816 3.8976 3.5504 3.9357 3.9282 4.0327 3.8058 3.8849 3.9260 3.9349 3.8553 1.0109 1.0020 0.9819 1.0048 1.0015 1.0072 1.0059 1.0098 0.9920 1.0012 1.0033 1.0047 1.0022 0.9982 0.9999 1.0006 0.9862
dispcorr: -0.020647554 hartree
energy: -1461.215092333024
dipole: 4.79375 -5.34797 -0.55422 11.36097 -11.88727 -0.52631 2.98171 -5.37062 -2.38891
magnitude: 2.50820 au
magnitude: 6.37533 debye
