program: Orca
programVersion: 5.0.2
elementType: S F F O O N C C C C C C C C C C C C C C C C C H H H H H H H H H H H H H H H H H
charge: 0
multiplicity: 1
keywords: wb97x-d3
keywords: def2-TZVPP
keywords: def2/J RIJCOSX
keywords: DEFGRID2
keywords: scfconv7
keywords: smallprint printgap noloewdin
keywords: NOSOSCF
formula: C17H17F2NO2S
InChI: InChI=1/C17H17F2NO2S/c1-11-6-7-23-16(11)15-8-17(2,22-20-15)10-21-9-12-13(18)4-3-5-14(12)19/h3-7H,8-10H2,1-2H3
40 atoms
S  2.588106 -1.153806 1.307064
F  -3.762324 -1.129728 0.610967
F  -0.20936 -0.741508 -2.408448
O  -1.202301 0.902669 1.370081
O  -1.948841 1.496385 -1.493181
N  -0.021474 0.228315 1.349981
C  -1.075482 2.185491 0.70465
C  0.343666 2.160444 0.125713
C  -2.164196 2.294749 -0.35567
C  0.851664 0.867589 0.67525
C  -1.261249 3.270039 1.751318
C  2.17802 0.317938 0.496648
C  3.223292 0.782407 -0.268323
C  -2.683279 0.298722 -1.604183
C  -2.030882 -0.889307 -0.949073
C  4.353279 -0.079203 -0.179803
C  3.231332 2.016186 -1.117162
C  4.154155 -1.153685 0.628835
C  -2.592742 -1.568262 0.120895
C  -0.808758 -1.378121 -1.389726
C  -2.014624 -2.675167 0.709505
C  -0.183938 -2.481153 -0.84615
C  -0.802784 -3.128302 0.212513
H  0.941851 3.006194 0.469141
H  0.366558 2.168763 -0.964762
H  -2.18765 3.334913 -0.695278
H  -3.139963 2.090257 0.102795
H  -1.139605 4.258287 1.306774
H  -2.253742 3.224378 2.20335
H  -0.521296 3.169629 2.546679
H  -2.7851 0.102592 -2.673863
H  -3.698268 0.429245 -1.220261
H  5.278326 0.106374 -0.708363
H  4.197548 2.128967 -1.607181
H  2.473774 1.979968 -1.900591
H  3.056739 2.920911 -0.534444
H  4.852209 -1.944925 0.858766
H  -2.500024 -3.168167 1.541176
H  0.766274 -2.821246 -1.234766
H  -0.332674 -3.994119 0.658875
elementType: S F O N C H
totalener: -1461.19078245 hartree
nucrepener: 2249.53174433 hartree
electener: -3710.72252678 hartree
oneelecener: -6478.53034760 hartree
twoeener: 2767.80782082 hartree
cpcmener: -0.02671028 hartree
kineticenergy: 1456.16393744 hartree
xcener: -118.613055836230 hartree
chargesum: -0.0000000
charge: 0.041065 -0.224130 -0.223918 -0.266147 -0.368724 -0.115476 0.293639 -0.147437 -0.016366 0.168036 -0.332421 -0.084978 -0.117633 0.022758 -0.185649 -0.171761 -0.251840 -0.180969 0.359389 0.355359 -0.238893 -0.283483 -0.083863 0.121724 0.114209 0.111181 0.096782 0.098096 0.105946 0.108027 0.115908 0.103572 0.149352 0.104075 0.111696 0.108590 0.159705 0.143969 0.141447 0.159167
qa: 0.0411 -0.2241 -0.2239 -0.2661 -0.3687 -0.1155 0.2936 -0.1474 -0.0164 0.1680 -0.3324 -0.0850 -0.1176 0.0228 -0.1856 -0.1718 -0.2518 -0.1810 0.3594 0.3554 -0.2389 -0.2835 -0.0839 0.1217 0.1142 0.1112 0.0968 0.0981 0.1059 0.1080 0.1159 0.1036 0.1494 0.1041 0.1117 0.1086 0.1597 0.1440 0.1414 0.1592
va: 2.7791 1.0603 1.0625 1.9802 1.9456 2.9291 3.8402 3.9762 3.9266 3.6558 3.9935 3.5164 3.7373 3.9275 3.5600 3.9435 3.9352 4.0294 3.7534 3.7492 3.9623 3.9407 3.7899 1.0060 1.0311 0.9995 1.0102 1.0047 1.0057 1.0009 0.9929 1.0094 1.0032 1.0022 0.9946 0.9929 0.9987 1.0018 1.0066 0.9868
dispcorr: -0.024528800 hartree
energy: -1461.215311251993
dipole: 7.02357 -6.13416 0.88941 17.90169 -16.78687 1.11482 -0.41346 -0.14703 -0.56049
magnitude: 1.53233 au
magnitude: 3.89487 debye
