program: Orca
programVersion: 5.0.2
elementType: S F F O O N C C C C C C C C C C C C C C C C C H H H H H H H H H H H H H H H H H
charge: 0
multiplicity: 1
keywords: wb97x-d3
keywords: def2-TZVPP
keywords: def2/J RIJCOSX
keywords: DEFGRID2
keywords: scfconv7
keywords: smallprint printgap noloewdin
keywords: NOSOSCF
formula: C17H17F2NO2S
InChI: InChI=1/C17H17F2NO2S/c1-11-6-7-23-16(11)15-8-17(2,22-20-15)10-21-9-12-13(18)4-3-5-14(12)19/h3-7H,8-10H2,1-2H3
40 atoms
S  3.104904 1.204804 -0.841583
F  -0.184049 -0.802177 -2.308979
F  -3.68685 -1.241773 0.760407
O  -1.184422 0.934768 1.407328
O  -2.058272 1.379803 -1.494044
N  0.010238 0.28517 1.396818
C  -1.113459 2.168088 0.645885
C  0.275404 2.118889 0.004617
C  -2.25679 2.191691 -0.363474
C  0.840149 0.885006 0.637236
C  -1.26692 3.320326 1.623901
C  2.180253 0.393639 0.379127
C  2.885749 -0.656388 0.922377
C  -2.713568 0.133954 -1.531953
C  -1.984714 -0.980455 -0.827794
C  4.171688 -0.782925 0.326261
C  2.439008 -1.573603 2.014334
C  4.424329 0.145867 -0.633864
C  -0.742708 -1.424726 -1.260205
C  -2.500536 -1.640886 0.276743
C  -0.059167 -2.473964 -0.680193
C  -1.862953 -2.693365 0.902966
C  -0.636236 -3.109181 0.4088
H  0.870311 3.003427 0.242831
H  0.245795 2.029506 -1.083685
H  -2.351481 3.219319 -0.726983
H  -3.196681 1.94946 0.148477
H  -2.241502 3.300245 2.115467
H  -0.496644 3.277545 2.395354
H  -1.169856 4.276682 1.108944
H  -2.812581 -0.121303 -2.589226
H  -3.731223 0.220225 -1.142366
H  4.880659 -1.548471 0.611896
H  3.026895 -1.401542 2.919005
H  1.391804 -1.448116 2.268941
H  2.599626 -2.614635 1.72941
H  5.317569 0.25898 -1.229815
H  0.901359 -2.783782 -1.069922
H  -2.316219 -3.17519 1.759082
H  -0.121382 -3.934705 0.881584
elementType: S F O N C H
totalener: -1461.18933882 hartree
nucrepener: 2256.48575662 hartree
electener: -3717.67509544 hartree
oneelecener: -6492.31833401 hartree
twoeener: 2774.64323856 hartree
cpcmener: -0.02389098 hartree
kineticenergy: 1456.15686377 hartree
xcener: -118.611934982965 hartree
chargesum: 0.0000000
charge: 0.032117 -0.221765 -0.223543 -0.266605 -0.366195 -0.114849 0.285332 -0.146513 -0.013986 0.245454 -0.329682 -0.074553 -0.219531 0.017346 -0.178651 -0.125565 -0.283096 -0.191140 0.345618 0.353249 -0.255645 -0.219969 -0.123418 0.123919 0.116243 0.110278 0.096466 0.106519 0.108151 0.097129 0.116722 0.104663 0.151154 0.119282 0.103777 0.107074 0.162052 0.146687 0.144839 0.160635
qa: 0.0321 -0.2218 -0.2235 -0.2666 -0.3662 -0.1148 0.2853 -0.1465 -0.0140 0.2455 -0.3297 -0.0746 -0.2195 0.0173 -0.1787 -0.1256 -0.2831 -0.1911 0.3456 0.3532 -0.2556 -0.2200 -0.1234 0.1239 0.1162 0.1103 0.0965 0.1065 0.1082 0.0971 0.1167 0.1047 0.1512 0.1193 0.1038 0.1071 0.1621 0.1467 0.1448 0.1606
va: 2.7683 1.0663 1.0613 1.9697 1.9475 2.9232 3.8165 3.9309 3.9291 3.5419 3.9954 3.5697 3.7494 3.9260 3.5493 3.9242 3.9279 4.0428 3.7660 3.7693 3.9046 3.9452 3.8030 1.0119 1.0332 0.9990 1.0102 1.0046 1.0011 1.0047 0.9931 1.0091 0.9984 0.9961 1.0251 0.9934 0.9985 1.0011 1.0011 0.9872
dispcorr: -0.025237695 hartree
energy: -1461.214576513081
dipole: 4.19396 -3.46332 0.73064 6.22467 -5.94857 0.27610 9.10715 -9.09281 0.01434
magnitude: 0.78120 au
magnitude: 1.98564 debye
