program: Orca
programVersion: 5.0.2
elementType: S F F O O N C C C C C C C C C C C C C C C C C H H H H H H H H H H H H H H H H H
charge: 0
multiplicity: 1
keywords: wb97x-d3
keywords: def2-TZVPP
keywords: def2/J RIJCOSX
keywords: DEFGRID2
keywords: scfconv7
keywords: smallprint printgap noloewdin
keywords: NOSOSCF
formula: C17H17F2NO2S
InChI: InChI=1/C17H17F2NO2S/c1-11-6-7-23-16(11)15-8-17(2,22-20-15)10-21-9-12-13(18)4-3-5-14(12)19/h3-7H,8-10H2,1-2H3
40 atoms
S  2.640411 0.417831 -0.941801
F  -2.520567 -1.986665 1.091362
F  -0.63145 -0.261964 -2.823791
O  -0.77894 2.459962 1.860062
O  -2.359057 0.867475 0.280216
N  0.171216 1.481489 1.9117
C  -1.029793 2.858107 0.486205
C  0.1370 2.233088 -0.278829
C  -2.37113 2.259837 0.081886
C  0.683589 1.302228 0.756863
C  -1.070236 4.369875 0.416517
C  1.701973 0.307202 0.506554
C  2.079042 -0.774535 1.269386
C  -2.64668 0.034351 -0.822137
C  -1.636013 -1.077026 -0.869472
C  3.135519 -1.50005 0.653453
C  1.471277 -1.173913 2.573312
C  3.534736 -0.977401 -0.537707
C  -1.597345 -2.049913 0.121541
C  -0.656156 -1.180084 -1.844864
C  -0.666943 -3.067369 0.157573
C  0.297775 -2.17918 -1.865627
C  0.283863 -3.123339 -0.852101
H  0.888682 2.97531 -0.565915
H  -0.170998 1.721609 -1.190938
H  -2.574328 2.524046 -0.962306
H  -3.168586 2.707984 0.687168
H  -1.246836 4.695248 -0.609518
H  -1.867447 4.78058 1.038022
H  -0.123649 4.801256 0.743359
H  -2.635671 0.593061 -1.760369
H  -3.654465 -0.382985 -0.723335
H  3.574408 -2.388054 1.08809
H  1.72569 -2.205818 2.81299
H  1.830578 -0.547176 3.392068
H  0.385243 -1.08372 2.562263
H  4.311396 -1.340201 -1.194347
H  -0.68311 -3.797998 0.955423
H  1.036949 -2.211476 -2.654421
H  1.025844 -3.910232 -0.845281
elementType: S F O N C H
totalener: -1461.19002504 hartree
nucrepener: 2274.51691124 hartree
electener: -3735.70693628 hartree
oneelecener: -6527.91582765 hartree
twoeener: 2792.20889137 hartree
cpcmener: -0.03025300 hartree
kineticenergy: 1456.14790656 hartree
xcener: -118.609249631846 hartree
chargesum: -0.0000000
charge: 0.026115 -0.217575 -0.222236 -0.278182 -0.366145 -0.119369 0.337385 -0.169251 -0.091195 0.207321 -0.306724 -0.024206 -0.214004 0.063569 -0.156538 -0.156883 -0.240865 -0.167220 0.294900 0.332533 -0.252229 -0.221140 -0.091907 0.123365 0.126059 0.096774 0.100368 0.102300 0.103787 0.100745 0.096822 0.108404 0.150651 0.101407 0.114730 0.095819 0.160342 0.147405 0.144168 0.160700
qa: 0.0261 -0.2176 -0.2222 -0.2782 -0.3661 -0.1194 0.3374 -0.1693 -0.0912 0.2073 -0.3067 -0.0242 -0.2140 0.0636 -0.1565 -0.1569 -0.2409 -0.1672 0.2949 0.3325 -0.2522 -0.2211 -0.0919 0.1234 0.1261 0.0968 0.1004 0.1023 0.1038 0.1007 0.0968 0.1084 0.1507 0.1014 0.1147 0.0958 0.1603 0.1474 0.1442 0.1607
va: 2.7497 1.0697 1.0645 1.9738 1.9758 2.9489 3.7737 3.9310 4.0639 3.5956 3.9600 3.5914 3.7486 3.8962 3.5746 3.9207 3.9374 4.0041 3.8567 3.7649 3.8890 3.8833 3.7814 1.0102 1.0095 0.9963 1.0051 1.0013 1.0073 1.0067 1.0083 0.9921 1.0019 0.9991 1.0004 1.0049 0.9970 1.0020 1.0059 0.9888
dispcorr: -0.026278571 hartree
energy: -1461.216303612961
dipole: 1.72650 -1.12148 0.60502 8.34942 -8.71527 -0.36586 4.27035 -6.38885 -2.11850
magnitude: 2.23337 au
magnitude: 5.67678 debye
