program: Orca
programVersion: 5.0.2
elementType: S F F O O N C C C C C C C C C C C C C C C C C H H H H H H H H H H H H H H H H H
charge: 0
multiplicity: 1
keywords: wb97x-d3
keywords: def2-TZVPP
keywords: def2/J RIJCOSX
keywords: DEFGRID2
keywords: scfconv7
keywords: smallprint printgap noloewdin
keywords: NOSOSCF
formula: C17H17F2NO2S
InChI: InChI=1/C17H17F2NO2S/c1-11-6-7-23-16(11)15-8-17(2,22-20-15)10-21-9-12-13(18)4-3-5-14(12)19/h3-7H,8-10H2,1-2H3
40 atoms
S  3.792546 0.338179 -0.741285
F  -0.955043 -2.951788 -1.024332
F  -4.679966 -0.350089 0.083592
O  -0.087584 2.19053 1.562579
O  -1.068742 -0.261341 0.617115
N  1.178587 1.768446 1.831703
C  -0.420142 1.987896 0.163577
C  0.890323 1.487223 -0.452992
C  -1.537277 0.962702 0.108936
C  1.75226 1.368174 0.763962
C  -0.888233 3.308597 -0.415465
C  3.115258 0.888129 0.750825
C  4.029277 0.806451 1.77814
C  -2.083365 -1.206425 0.864021
C  -2.790942 -1.650392 -0.390514
C  5.274294 0.294253 1.324674
C  3.777149 1.203914 3.194755
C  5.290804 -0.003379 -0.003586
C  -2.18494 -2.50169 -1.305804
C  -4.055711 -1.200962 -0.742932
C  -2.783362 -2.913416 -2.478961
C  -4.702955 -1.572848 -1.905321
C  -4.053624 -2.438241 -2.770981
H  1.312185 2.204848 -1.16204
H  0.782153 0.537986 -0.981643
H  -1.875167 0.86538 -0.931785
H  -2.390504 1.332461 0.694991
H  -1.129109 3.194261 -1.47286
H  -1.780077 3.676563 0.094046
H  -0.108377 4.066201 -0.331838
H  -2.809582 -0.81475 1.583366
H  -1.598479 -2.058795 1.340784
H  6.127143 0.154048 1.974591
H  2.962482 0.629374 3.636831
H  4.668235 1.044815 3.800228
H  3.498064 2.255166 3.276009
H  6.109303 -0.402112 -0.583564
H  -2.267609 -3.58753 -3.149394
H  -5.690811 -1.191699 -2.126689
H  -4.541911 -2.745395 -3.685763
elementType: S F O N C H
totalener: -1461.19525006 hartree
nucrepener: 2072.81773247 hartree
electener: -3534.01298253 hartree
oneelecener: -6124.27073610 hartree
twoeener: 2590.25775357 hartree
cpcmener: -0.02707543 hartree
kineticenergy: 1456.15473249 hartree
xcener: -118.606269543588 hartree
chargesum: 0.0000000
charge: 0.034590 -0.216021 -0.217732 -0.270862 -0.344149 -0.144212 0.291132 -0.118377 -0.069831 0.268225 -0.314476 -0.115414 -0.174848 0.045513 -0.220831 -0.147872 -0.212103 -0.186930 0.289883 0.352674 -0.234669 -0.221968 -0.100600 0.120047 0.116238 0.093572 0.103773 0.100950 0.104883 0.105723 0.104207 0.108876 0.151024 0.098546 0.095936 0.097538 0.162527 0.150502 0.150190 0.164353
qa: 0.0346 -0.2160 -0.2177 -0.2709 -0.3441 -0.1442 0.2911 -0.1184 -0.0698 0.2682 -0.3145 -0.1154 -0.1748 0.0455 -0.2208 -0.1479 -0.2121 -0.1869 0.2899 0.3527 -0.2347 -0.2220 -0.1006 0.1200 0.1162 0.0936 0.1038 0.1010 0.1049 0.1057 0.1042 0.1089 0.1510 0.0985 0.0959 0.0975 0.1625 0.1505 0.1502 0.1644
va: 2.7781 1.0758 1.0683 1.9685 1.9609 2.9538 3.8720 3.9022 4.0060 3.5741 3.9801 3.6577 3.7906 3.9093 3.5447 3.9385 3.9293 4.0311 3.8866 3.7699 3.9402 3.9498 3.8342 1.0118 1.0196 0.9926 1.0044 1.0025 1.0060 1.0037 1.0067 0.9915 1.0015 1.0041 1.0024 1.0041 0.9981 1.0002 1.0009 0.9857
dispcorr: -0.018915672 hartree
energy: -1461.214165733457
dipole: 6.40084 -6.95601 -0.55517 11.73200 -12.18047 -0.44846 2.67762 -4.75857 -2.08095
magnitude: 2.19993 au
magnitude: 5.59177 debye
