program: Orca
programVersion: 5.0.2
elementType: S F F O O N C C C C C C C C C C C C C C C C C H H H H H H H H H H H H H H H H H
charge: 0
multiplicity: 1
keywords: wb97x-d3
keywords: def2-TZVPP
keywords: def2/J RIJCOSX
keywords: DEFGRID2
keywords: scfconv7
keywords: smallprint printgap noloewdin
keywords: NOSOSCF
formula: C17H17F2NO2S
InChI: InChI=1/C17H17F2NO2S/c1-11-6-7-23-16(11)15-8-17(2,22-20-15)10-21-9-12-13(18)4-3-5-14(12)19/h3-7H,8-10H2,1-2H3
40 atoms
S  2.677257 0.785744 -1.365855
F  -1.60849 -0.375714 -2.720489
F  -2.287206 -1.768912 1.700359
O  -1.082747 1.153765 1.705631
O  -2.779361 1.282411 -0.836798
N  0.109073 0.501347 1.594347
C  -1.148821 2.256828 0.767451
C  0.006629 1.976806 -0.193737
C  -2.533828 2.26881 0.12973
C  0.740684 0.912562 0.56404
C  -0.942479 3.542486 1.551038
C  2.012943 0.352816 0.170122
C  2.816199 -0.550509 0.830019
C  -3.135249 -0.009524 -0.394359
C  -1.993968 -0.989649 -0.492312
C  3.964033 -0.881254 0.060598
C  2.547054 -1.124395 2.181856
C  4.02063 -0.240845 -1.139099
C  -1.256466 -1.121732 -1.663512
C  -1.605468 -1.821698 0.54637
C  -0.184012 -1.977962 -1.802604
C  -0.550818 -2.710402 0.460159
C  0.166489 -2.774634 -0.722762
H  0.622314 2.862189 -0.362537
H  -0.316526 1.613256 -1.172053
H  -2.649688 3.224651 -0.38666
H  -3.290189 2.244127 0.925287
H  -0.938011 4.403224 0.882125
H  -1.73461 3.691616 2.286844
H  0.011841 3.527971 2.079793
H  -3.952535 -0.352216 -1.035549
H  -3.531915 0.014428 0.623031
H  4.722008 -1.574772 0.39869
H  3.39388 -1.72114 2.518629
H  2.365559 -0.345647 2.923521
H  1.665253 -1.766372 2.180315
H  4.783999 -0.319894 -1.898525
H  0.35834 -2.022579 -2.737568
H  -0.293344 -3.331429 1.307775
H  1.003438 -3.454364 -0.807677
elementType: S F O N C H
totalener: -1461.19047218 hartree
nucrepener: 2274.39330257 hartree
electener: -3735.58377476 hartree
oneelecener: -6527.78944723 hartree
twoeener: 2792.20567247 hartree
cpcmener: -0.02466152 hartree
kineticenergy: 1456.15266149 hartree
xcener: -118.611912959215 hartree
chargesum: -0.0000000
charge: 0.032270 -0.215691 -0.221648 -0.274156 -0.366174 -0.128688 0.279014 -0.169883 -0.013769 0.294925 -0.331755 -0.130011 -0.201012 0.035517 -0.073668 -0.140293 -0.220842 -0.188593 0.239903 0.316573 -0.211148 -0.228428 -0.138581 0.130198 0.123048 0.105223 0.099575 0.096664 0.105664 0.110252 0.117069 0.105491 0.150592 0.098437 0.098257 0.104724 0.162046 0.141587 0.148856 0.158453
qa: 0.0323 -0.2157 -0.2216 -0.2742 -0.3662 -0.1287 0.2790 -0.1699 -0.0138 0.2949 -0.3318 -0.1300 -0.2010 0.0355 -0.0737 -0.1403 -0.2208 -0.1886 0.2399 0.3166 -0.2111 -0.2284 -0.1386 0.1302 0.1230 0.1052 0.0996 0.0967 0.1057 0.1103 0.1171 0.1055 0.1506 0.0984 0.0983 0.1047 0.1620 0.1416 0.1489 0.1585
va: 2.7604 1.0723 1.0658 1.9751 1.9587 2.8796 3.7807 3.9521 3.9370 3.4702 3.9944 3.5742 3.7551 3.9408 3.5139 3.9284 3.9388 4.0339 3.8807 3.7886 3.8702 3.8673 3.7875 1.0110 1.0203 0.9980 1.0074 1.0051 1.0059 0.9990 0.9903 1.0125 1.0013 1.0026 1.0052 0.9979 0.9983 1.0068 0.9990 0.9898
dispcorr: -0.026151689 hartree
energy: -1461.216623873179
dipole: 6.02148 -4.97270 1.04878 8.17983 -7.88608 0.29375 8.62638 -9.06674 -0.44036
magnitude: 1.17479 au
magnitude: 2.98608 debye
