program: Orca
programVersion: 5.0.2
elementType: S F F O O N C C C C C C C C C C C C C C C C C H H H H H H H H H H H H H H H H H
charge: 0
multiplicity: 1
keywords: wb97x-d3
keywords: def2-TZVPP
keywords: def2/J RIJCOSX
keywords: DEFGRID2
keywords: scfconv7
keywords: smallprint printgap noloewdin
keywords: NOSOSCF
formula: C17H17F2NO2S
InChI: InChI=1/C17H17F2NO2S/c1-11-6-7-23-16(11)15-8-17(2,22-20-15)10-21-9-12-13(18)4-3-5-14(12)19/h3-7H,8-10H2,1-2H3
40 atoms
S  2.842476 1.188985 -0.856438
F  -0.251524 -0.217256 -2.343446
F  -3.000239 -2.604475 0.594976
O  -0.771548 2.25995 2.246966
O  -1.804606 0.679381 0.219753
N  0.286584 1.396518 2.108006
C  -1.114377 2.825241 0.956683
C  0.170787 2.635151 0.155456
C  -2.251738 2.001909 0.362965
C  0.806727 1.536036 0.951273
C  -1.537246 4.264103 1.151934
C  1.857908 0.671131 0.468029
C  2.187486 -0.602383 0.872845
C  -2.515137 -0.121551 -0.69372
C  -1.687211 -1.357689 -0.887928
C  3.255304 -1.133508 0.09833
C  1.500705 -1.37368 1.951397
C  3.706225 -0.282688 -0.862584
C  -0.539807 -1.340046 -1.671694
C  -1.924449 -2.538858 -0.200815
C  0.313502 -2.416261 -1.798865
C  -1.107317 -3.649197 -0.290578
C  0.017693 -3.57533 -1.096659
H  0.803875 3.528598 0.167952
H  -0.006365 2.370732 -0.887085
H  -2.528075 2.43823 -0.606452
H  -3.13825 2.05533 1.010412
H  -1.780848 4.718256 0.191127
H  -2.420698 4.339285 1.787972
H  -0.737407 4.849977 1.604869
H  -2.658172 0.399074 -1.647577
H  -3.514455 -0.369127 -0.321482
H  3.661488 -2.124202 0.250994
H  1.717838 -2.43727 1.85914
H  1.82514 -1.056822 2.944228
H  0.419067 -1.240635 1.917739
H  4.501255 -0.44653 -1.574644
H  1.191275 -2.345394 -2.427265
H  -1.344464 -4.5477 0.263404
H  0.67287 -4.431818 -1.179593
elementType: S F O N C H
totalener: -1461.19152887 hartree
nucrepener: 2235.94189246 hartree
electener: -3697.13342133 hartree
oneelecener: -6451.08070705 hartree
twoeener: 2753.94728572 hartree
cpcmener: -0.02844463 hartree
kineticenergy: 1456.15518297 hartree
xcener: -118.605319127433 hartree
chargesum: 0.0000000
charge: 0.038165 -0.218162 -0.217860 -0.280499 -0.329504 -0.128673 0.324798 -0.143427 -0.094572 0.160358 -0.297114 -0.007565 -0.174805 0.061397 -0.192480 -0.173496 -0.246217 -0.171188 0.304878 0.325865 -0.222132 -0.222075 -0.107651 0.120841 0.111326 0.093462 0.102428 0.101954 0.104742 0.099692 0.101205 0.092810 0.152240 0.099548 0.116869 0.094407 0.162557 0.147527 0.148286 0.162066
qa: 0.0382 -0.2182 -0.2179 -0.2805 -0.3295 -0.1287 0.3248 -0.1434 -0.0946 0.1604 -0.2971 -0.0076 -0.1748 0.0614 -0.1925 -0.1735 -0.2462 -0.1712 0.3049 0.3259 -0.2221 -0.2221 -0.1077 0.1208 0.1113 0.0935 0.1024 0.1020 0.1047 0.0997 0.1012 0.0928 0.1522 0.0995 0.1169 0.0944 0.1626 0.1475 0.1483 0.1621
va: 2.7624 1.0670 1.0738 1.9702 1.9745 2.9303 3.8297 3.9315 4.0365 3.7033 3.9438 3.6369 3.7501 3.9182 3.6682 3.9362 3.9310 4.0196 3.7936 3.8434 3.8975 3.9280 3.8227 1.0117 1.0179 0.9959 1.0024 1.0016 1.0064 1.0088 0.9980 0.9982 1.0018 0.9998 1.0017 1.0088 0.9966 1.0024 1.0003 0.9867
dispcorr: -0.024394241 hartree
energy: -1461.215923111676
dipole: -0.33885 0.38956 0.05070 7.84065 -8.05696 -0.21631 4.61841 -6.64051 -2.02210
magnitude: 2.03427 au
magnitude: 5.17070 debye
