program: Orca
programVersion: 5.0.2
elementType: S F F O O N C C C C C C C C C C C C C C C C C H H H H H H H H H H H H H H H H H
charge: 0
multiplicity: 1
keywords: wb97x-d3
keywords: def2-TZVPP
keywords: def2/J RIJCOSX
keywords: DEFGRID2
keywords: scfconv7
keywords: smallprint printgap noloewdin
keywords: NOSOSCF
formula: C17H17F2NO2S
InChI: InChI=1/C17H17F2NO2S/c1-11-6-7-23-16(11)15-8-17(2,22-20-15)10-21-9-12-13(18)4-3-5-14(12)19/h3-7H,8-10H2,1-2H3
40 atoms
S  2.734488 -0.302087 -0.534053
F  -0.451655 -1.994626 0.813774
F  -3.536115 -0.485214 -2.368093
O  -0.470485 2.757838 1.498707
O  -2.05145 0.600585 0.880462
N  0.554618 1.931885 1.860381
C  -0.848025 2.529221 0.116677
C  0.299257 1.677096 -0.428165
C  -2.169709 1.775976 0.113665
C  0.9973 1.304287 0.840712
C  -0.998133 3.86892 -0.573766
C  2.077905 0.349051 0.925964
C  2.707436 -0.169722 2.035601
C  -2.774136 -0.510541 0.399388
C  -2.036642 -1.208009 -0.714699
C  3.722474 -1.09423 1.670954
C  2.382182 0.168943 3.452669
C  3.849904 -1.262205 0.326096
C  -0.864307 -1.910114 -0.457459
C  -2.41256 -1.146217 -2.048684
C  -0.107224 -2.520451 -1.43487
C  -1.693598 -1.735693 -3.071449
C  -0.534775 -2.424534 -2.751156
H  0.965288 2.24883 -1.08181
H  -0.045545 0.811021 -0.99637
H  -2.432771 1.567663 -0.929608
H  -2.965891 2.412232 0.522727
H  -1.275866 3.726208 -1.618823
H  -1.771193 4.478805 -0.103877
H  -0.060999 4.425266 -0.551359
H  -3.780753 -0.227593 0.079562
H  -2.899868 -1.190129 1.243484
H  4.333571 -1.616669 2.394387
H  2.627642 1.205713 3.687695
H  1.32011 0.042356 3.665267
H  2.942378 -0.468535 4.135381
H  4.542173 -1.90225 -0.200251
H  0.795314 -3.055517 -1.172403
H  -2.033349 -1.653775 -4.095243
H  0.045709 -2.889344 -3.536466
elementType: S F O N C H
totalener: -1461.19241885 hartree
nucrepener: 2218.30922527 hartree
electener: -3679.50164412 hartree
oneelecener: -6415.20691946 hartree
twoeener: 2735.70527534 hartree
cpcmener: -0.02913271 hartree
kineticenergy: 1456.14966959 hartree
xcener: -118.607295859192 hartree
chargesum: 0.0000000
charge: 0.031769 -0.214489 -0.220934 -0.276457 -0.360016 -0.135764 0.324860 -0.128015 -0.101397 0.240360 -0.308527 -0.079420 -0.184464 0.043021 -0.171045 -0.136957 -0.216408 -0.192281 0.263567 0.354955 -0.233575 -0.227980 -0.098676 0.124546 0.099356 0.098045 0.108053 0.102303 0.103774 0.102234 0.106998 0.113524 0.151370 0.099656 0.097587 0.095835 0.160936 0.150005 0.149785 0.163862
qa: 0.0318 -0.2145 -0.2209 -0.2765 -0.3600 -0.1358 0.3249 -0.1280 -0.1014 0.2404 -0.3085 -0.0794 -0.1845 0.0430 -0.1710 -0.1370 -0.2164 -0.1923 0.2636 0.3550 -0.2336 -0.2280 -0.0987 0.1245 0.0994 0.0980 0.1081 0.1023 0.1038 0.1022 0.1070 0.1135 0.1514 0.0997 0.0976 0.0958 0.1609 0.1500 0.1498 0.1639
va: 2.7607 1.0726 1.0654 1.9690 1.9617 2.9515 3.8042 3.9269 4.0507 3.5814 3.9622 3.5987 3.8080 3.9070 3.5663 3.9137 3.9271 4.0187 3.8267 3.7613 3.9093 3.9470 3.8417 1.0116 1.0166 0.9907 1.0054 1.0007 1.0076 1.0064 1.0036 0.9955 1.0010 1.0023 1.0061 1.0020 0.9983 1.0023 1.0001 0.9855
dispcorr: -0.023266654 hartree
energy: -1461.215685503136
dipole: 3.91766 -3.70537 0.21229 9.61414 -10.62105 -1.00691 2.86560 -5.23987 -2.37427
magnitude: 2.58768 au
magnitude: 6.57736 debye
