program: Orca
programVersion: 5.0.2
elementType: S F F O O N C C C C C C C C C C C C C C C C C H H H H H H H H H H H H H H H H H
charge: 0
multiplicity: 1
keywords: wb97x-d3
keywords: def2-TZVPP
keywords: def2/J RIJCOSX
keywords: DEFGRID2
keywords: scfconv7
keywords: smallprint printgap noloewdin
keywords: NOSOSCF
formula: C17H17F2NO2S
InChI: InChI=1/C17H17F2NO2S/c1-11-6-7-23-16(11)15-8-17(2,22-20-15)10-21-9-12-13(18)4-3-5-14(12)19/h3-7H,8-10H2,1-2H3
40 atoms
S  3.090382 1.054257 -0.956204
F  -3.646064 -1.358377 0.8269
F  -0.343538 -0.713558 -2.419772
O  -1.160516 0.921846 1.397073
O  -2.148692 1.390363 -1.449759
N  0.039748 0.280464 1.380731
C  -1.095928 2.162862 0.646547
C  0.271677 2.100147 -0.039471
C  -2.273954 2.215676 -0.319345
C  0.854971 0.885049 0.607484
C  -1.193862 3.307713 1.640514
C  2.196594 0.39889 0.368585
C  2.917492 -0.567111 1.03406
C  -2.819692 0.152499 -1.441554
C  -2.032385 -0.975245 -0.826678
C  4.197448 -0.754576 0.444272
C  2.453129 -1.333716 2.22846
C  4.427537 0.048336 -0.630476
C  -2.468247 -1.691805 0.277157
C  -0.808381 -1.371317 -1.347153
C  -1.760875 -2.737088 0.837085
C  -0.054848 -2.406671 -0.833149
C  -0.545585 -3.088996 0.269976
H  0.871486 2.991365 0.156954
H  0.208992 1.983013 -1.124089
H  -2.349149 3.243333 -0.687285
H  -3.20085 2.008277 0.230496
H  -0.397818 3.244309 2.384076
H  -1.096943 4.267289 1.131411
H  -2.150577 3.300546 2.166231
H  -3.024149 -0.087674 -2.487256
H  -3.792494 0.242562 -0.951629
H  4.921938 -1.465253 0.818354
H  2.042864 -0.67949 2.998167
H  1.668896 -2.046664 1.969806
H  3.279823 -1.892622 2.66554
H  5.313534 0.095117 -1.245676
H  -2.150415 -3.261763 1.699356
H  0.89392 -2.67052 -1.281222
H  0.024327 -3.906256 0.691122
elementType: S F O N C H
totalener: -1461.19102646 hartree
nucrepener: 2252.61175904 hartree
electener: -3713.80278551 hartree
oneelecener: -6484.52040984 hartree
twoeener: 2770.71762433 hartree
cpcmener: -0.02450661 hartree
kineticenergy: 1456.15591875 hartree
xcener: -118.610584552129 hartree
chargesum: -0.0000000
charge: 0.034828 -0.223505 -0.221392 -0.266813 -0.366378 -0.119849 0.284837 -0.145271 -0.010918 0.251307 -0.331534 -0.105154 -0.211627 0.022721 -0.179686 -0.130217 -0.224488 -0.194152 0.352395 0.351407 -0.219572 -0.265660 -0.126107 0.123938 0.116351 0.110194 0.095450 0.109090 0.097178 0.106191 0.117014 0.103509 0.150059 0.098179 0.099103 0.099896 0.161952 0.145654 0.146509 0.164562
qa: 0.0348 -0.2235 -0.2214 -0.2668 -0.3664 -0.1198 0.2848 -0.1453 -0.0109 0.2513 -0.3315 -0.1052 -0.2116 0.0227 -0.1797 -0.1302 -0.2245 -0.1942 0.3524 0.3514 -0.2196 -0.2657 -0.1261 0.1239 0.1164 0.1102 0.0955 0.1091 0.0972 0.1062 0.1170 0.1035 0.1501 0.0982 0.0991 0.0999 0.1620 0.1457 0.1465 0.1646
va: 2.7772 1.0623 1.0673 1.9687 1.9512 2.8929 3.8146 3.9395 3.9318 3.5129 3.9968 3.6083 3.7698 3.9281 3.5568 3.9231 3.9404 4.0421 3.7762 3.7460 3.9434 3.9110 3.7965 1.0128 1.0314 0.9984 1.0098 1.0003 1.0050 1.0050 0.9924 1.0103 1.0015 1.0045 1.0016 1.0026 0.9988 1.0008 1.0016 0.9844
dispcorr: -0.025007084 hartree
energy: -1461.216033546261
dipole: 4.59049 -3.83294 0.75755 7.08993 -6.71744 0.37250 10.00413 -9.95863 0.04551
magnitude: 0.84540 au
magnitude: 2.14884 debye
