program: Orca
programVersion: 5.0.2
elementType: S F F O O N C C C C C C C C C C C C C C C C C H H H H H H H H H H H H H H H H H
charge: 0
multiplicity: 1
keywords: wb97x-d3
keywords: def2-TZVPP
keywords: def2/J RIJCOSX
keywords: DEFGRID2
keywords: scfconv7
keywords: smallprint printgap noloewdin
keywords: NOSOSCF
formula: C17H17F2NO2S
InChI: InChI=1/C17H17F2NO2S/c1-11-6-7-23-16(11)15-8-17(2,22-20-15)10-21-9-12-13(18)4-3-5-14(12)19/h3-7H,8-10H2,1-2H3
40 atoms
S  3.588475 -0.126981 -0.155904
F  -0.786417 -2.316519 -0.49916
F  -5.183293 -0.946994 -1.326536
O  0.111906 2.842871 1.531977
O  -1.972759 0.418065 -0.135028
N  1.373543 2.431062 1.857674
C  -0.391609 2.109481 0.387167
C  0.817885 1.30582 -0.095985
C  -1.493606 1.203076 0.927281
C  1.799212 1.587637 0.999143
C  -0.902129 3.1060 -0.634323
C  3.110025 0.986739 1.077986
C  4.103198 1.151074 2.01847
C  -2.846471 -0.608705 0.278194
C  -2.980724 -1.586504 -0.850555
C  5.243747 0.362482 1.711297
C  4.023351 2.035193 3.218643
C  5.10945 -0.371453 0.572654
C  -1.916382 -2.40259 -1.214697
C  -4.126107 -1.715605 -1.621786
C  -1.965855 -3.300591 -2.259551
C  -4.235529 -2.601816 -2.676925
C  -3.141884 -3.392659 -2.990044
H  1.197931 1.653508 -1.060722
H  0.606193 0.239821 -0.197874
H  -2.294892 1.811456 1.36928
H  -1.085044 0.56741 1.726234
H  -1.720343 3.706113 -0.232894
H  -0.102829 3.779194 -0.946743
H  -1.26781 2.592897 -1.523253
H  -3.821588 -0.204003 0.566206
H  -2.450649 -1.120163 1.163946
H  6.133959 0.347948 2.325148
H  3.897339 3.082736 2.941373
H  3.177944 1.775907 3.857036
H  4.932269 1.952673 3.812888
H  5.827433 -1.044641 0.12876
H  -1.106348 -3.913874 -2.495234
H  -5.156042 -2.667491 -3.241344
H  -3.205344 -4.091104 -3.813375
elementType: S F O N C H
totalener: -1461.19475508 hartree
nucrepener: 2045.97360695 hartree
electener: -3507.16836202 hartree
oneelecener: -6070.12194509 hartree
twoeener: 2562.95358306 hartree
cpcmener: -0.02355251 hartree
kineticenergy: 1456.14222814 hartree
xcener: -118.601014340053 hartree
chargesum: 0.0000000
charge: 0.035732 -0.216751 -0.216954 -0.271332 -0.363508 -0.149758 0.294748 -0.121404 -0.081356 0.268141 -0.311485 -0.115364 -0.173510 0.081909 -0.191672 -0.144981 -0.213962 -0.185317 0.297115 0.315806 -0.222301 -0.226606 -0.101433 0.116425 0.107849 0.107130 0.111994 0.101938 0.104201 0.097069 0.094560 0.102876 0.151095 0.099215 0.098353 0.096177 0.163045 0.150650 0.148880 0.162787
qa: 0.0357 -0.2168 -0.2170 -0.2713 -0.3635 -0.1498 0.2947 -0.1214 -0.0814 0.2681 -0.3115 -0.1154 -0.1735 0.0819 -0.1917 -0.1450 -0.2140 -0.1853 0.2971 0.3158 -0.2223 -0.2266 -0.1014 0.1164 0.1078 0.1071 0.1120 0.1019 0.1042 0.0971 0.0946 0.1029 0.1511 0.0992 0.0984 0.0962 0.1630 0.1506 0.1489 0.1628
va: 2.7782 1.0748 1.0749 1.9689 1.9366 2.9470 3.8676 3.9142 4.0464 3.5864 3.9562 3.6718 3.7895 3.8756 3.6414 3.9359 3.9302 4.0312 3.8734 3.8595 3.9491 3.9366 3.8397 1.0090 1.0251 0.9993 0.9962 1.0068 1.0048 1.0137 1.0068 0.9925 1.0013 1.0030 1.0041 1.0024 0.9979 1.0008 1.0009 0.9862
dispcorr: -0.018349816 hartree
energy: -1461.213104892574
dipole: 8.86741 -8.76743 0.09998 10.90531 -12.49519 -1.58988 5.86688 -6.85064 -0.98375
magnitude: 1.87229 au
magnitude: 4.75899 debye
