program: Orca
programVersion: 5.0.2
elementType: S F F O O N C C C C C C C C C C C C C C C C C H H H H H H H H H H H H H H H H H
charge: 0
multiplicity: 1
keywords: wb97x-d3
keywords: def2-TZVPP
keywords: def2/J RIJCOSX
keywords: DEFGRID2
keywords: scfconv7
keywords: smallprint printgap noloewdin
keywords: NOSOSCF
formula: C17H17F2NO2S
InChI: InChI=1/C17H17F2NO2S/c1-11-6-7-23-16(11)15-8-17(2,22-20-15)10-21-9-12-13(18)4-3-5-14(12)19/h3-7H,8-10H2,1-2H3
40 atoms
S  3.596538 0.224857 -0.729036
F  -5.33366 -1.303991 -0.359655
F  -0.787729 -2.212893 -1.011764
O  0.224664 2.48632 1.970304
O  -1.963573 0.165481 0.284709
N  1.561564 2.20936 1.99585
C  -0.411227 1.877303 0.818556
C  0.755629 1.286973 0.022717
C  -1.330102 0.792319 1.371333
C  1.898353 1.553963 0.953399
C  -1.171946 2.95328 0.069513
C  3.258278 1.13716 0.700792
C  4.401447 1.358575 1.437038
C  -2.668118 -1.000229 0.644436
C  -3.041259 -1.733744 -0.609735
C  5.538228 0.774364 0.817633
C  4.471756 2.112446 2.723591
C  5.255423 0.131807 -0.348606
C  -4.343983 -1.864191 -1.06873
C  -2.063572 -2.316521 -1.40797
C  -4.678144 -2.548498 -2.222185
C  -2.336926 -3.004018 -2.571489
C  -3.660919 -3.117503 -2.970671
H  0.907003 1.786793 -0.937929
H  0.633163 0.221711 -0.184046
H  -2.063834 1.236556 2.057837
H  -0.7368 0.068786 1.948503
H  -0.498833 3.747783 -0.253895
H  -1.648523 2.542352 -0.819734
H  -1.950812 3.395539 0.692229
H  -3.556372 -0.757311 1.234965
H  -2.046508 -1.647465 1.275104
H  6.534179 0.834767 1.235027
H  3.854624 1.652813 3.496729
H  5.496939 2.147109 3.089248
H  4.119971 3.138846 2.61147
H  5.939264 -0.387561 -1.003277
H  -5.713344 -2.630089 -2.52591
H  -1.534113 -3.440938 -3.150389
H  -3.9013 -3.655959 -3.877316
elementType: S F O N C H
totalener: -1461.19467387 hartree
nucrepener: 2037.84339246 hartree
electener: -3499.03806634 hartree
oneelecener: -6053.84178146 hartree
twoeener: 2554.80371512 hartree
cpcmener: -0.02360380 hartree
kineticenergy: 1456.13906673 hartree
xcener: -118.600502996547 hartree
chargesum: -0.0000000
charge: 0.035596 -0.217166 -0.215213 -0.269928 -0.363273 -0.149702 0.296295 -0.123723 -0.077760 0.269811 -0.314485 -0.116886 -0.171038 0.083074 -0.191159 -0.146138 -0.213891 -0.184282 0.319097 0.294953 -0.228832 -0.227008 -0.098695 0.115782 0.107764 0.107481 0.111017 0.104464 0.096669 0.102158 0.093063 0.103490 0.151064 0.098290 0.096409 0.098572 0.162089 0.148613 0.150503 0.162926
qa: 0.0356 -0.2172 -0.2152 -0.2699 -0.3633 -0.1497 0.2963 -0.1237 -0.0778 0.2698 -0.3145 -0.1169 -0.1710 0.0831 -0.1912 -0.1461 -0.2139 -0.1843 0.3191 0.2950 -0.2288 -0.2270 -0.0987 0.1158 0.1078 0.1075 0.1110 0.1045 0.0967 0.1022 0.0931 0.1035 0.1511 0.0983 0.0964 0.0986 0.1621 0.1486 0.1505 0.1629
va: 2.7781 1.0746 1.0759 1.9713 1.9387 2.9469 3.8583 3.9206 4.0424 3.5878 3.9633 3.6695 3.7862 3.8780 3.6393 3.9370 3.9314 4.0312 3.8548 3.8771 3.9389 3.9558 3.8402 1.0090 1.0236 0.9998 0.9962 1.0043 1.0143 1.0069 1.0072 0.9918 1.0015 1.0036 1.0025 1.0036 0.9983 1.0011 1.0011 0.9861
dispcorr: -0.018252302 hartree
energy: -1461.212926174305
dipole: 9.34026 -9.32023 0.02004 10.93015 -12.30074 -1.37059 5.92953 -7.17803 -1.24850
magnitude: 1.85409 au
magnitude: 4.71273 debye
